{"text_format":"1","workbook":"xlsx","n_sheets":12,"sheets":["Instructions","LEA Background","Physical Health And Safety","Meeting Various Needs","Mental Health","Other","Summary","LEA Info","Awarded","Expended","Prior","Remaining"],"not_rendered":{"charts":0,"images":3,"macros":1,"external_links":0,"defined_names":6,"comments":2,"pivot_tables":0},"unopened":[],"bounds":{"document_bytes":16777216,"sheet_cells":100000,"rows_first":2000,"rows_last":500,"rows_between":2000,"halvings":0,"cell_chars":16384,"cell_head_chars":4096},"cells_cut":0,"cells_raw":0,"read":"whole","date_system":"1900"}

{"sheet":"Instructions","index":0,"n_rows":68,"n_cols":13,"rows_kept":68,"cut":false,"hidden":false,"merged":[[60,3,61,10],[64,3,65,10],[67,3,69,10],[61,12,61,16],[57,3,57,10],[55,4,55,6],[46,6,46,8],[43,3,45,11],[47,3,48,11],[29,3,30,11],[31,3,32,11],[40,3,42,11],[0,0,2,12],[26,3,26,11],[51,3,52,11],[53,4,53,8],[54,4,54,13]]}
["While you still need to submit information into the online reporting site, this workbook is intended to be a resource to help you in organizing ESSER expenses. If you have any questions, feel free to contact SDE. This first tab will show you how to use this workbook, though do not feel obligated to use this as SDE will only accept information submitted through the online site"]
[]
[]
[null,null,"You first will go to the \"LEA Background\" tab at the bottom of the screen:"]
[]
[]
[]
[]
{"$rows_left_out":61}
{"sheet":"LEA Background","index":1,"n_rows":30,"n_cols":12,"rows_kept":30,"cut":false,"hidden":false,"merged":[[1,1,1,2],[5,1,5,2],[23,1,25,3],[8,1,11,2],[2,1,4,2],[6,1,7,2],[12,1,12,2],[15,1,15,3],[14,1,14,3],[17,1,19,1],[17,2,19,2],[17,3,19,3],[20,1,20,3],[21,1,22,1],[21,3,22,3],[21,2,22,2]]}
[null,"Please enter your LEA State ID in cell C1:",null,"*Check the \"LEA Info\" tab if you need help finding your ID; will only be three digits"]
[null,"Your LEA Name:"]
[null,{"$f":"IFERROR(VLOOKUP($C$1,'LEA Info'!$A$2:$D$200,2,FALSE),\"Please double check that you entered the correct ID number\")","v":"Please double check that you entered the correct ID number"}]
[null,null,null," "]
[]
[null,"Your LEA NCES Number:"]
[null,{"$f":"IFERROR(VLOOKUP($C$1,'LEA Info'!$A$2:$D$200,4,FALSE),\"Please double check that you entered the correct ID number\")","v":"Please double check that you entered the correct ID number"}]
[]
{"$rows_left_out":23}
{"sheet":"Physical Health And Safety","index":2,"n_rows":23,"n_cols":11,"rows_kept":23,"cut":false,"hidden":false,"merged":[[19,3,19,4],[14,1,14,4],[18,6,19,9],[0,0,0,2],[0,3,0,6],[17,6,17,9],[11,0,12,10],[15,1,15,4]]}
[{"$f":"'LEA Background'!B3","v":"Please double check that you entered the correct ID number"},null,null,{"$f":"'LEA Background'!B16","v":0}]
["Expense Type","a. Personnel Services - Salaries","b. Personnel Services - Benefits","c. Purchased Professional and Technical Services","d. Purchased Property Services","e. Other Purchased Services","f. Supplies","g. Property","h. Debt Service and Miscellaneous","i. Other Items","Row Total"]
["a. Building and facilities upgrades and maintenance, including ventilation systems and new construction",null,null,null,null,null,null,null,null,null,{"$f":"SUM(B3:J3)","v":0}]
["b. Assistance with meals for students",null,null,null,null,null,null,null,null,null,{"$f":"SUM(B4:J4)","v":0}]
["c. Cleaning and/or sanitization supplies",null,null,null,null,null,null,null,null,null,0]
["d. Temporary classroom space to support social distancing",null,null,null,null,null,null,null,null,null,0]
["e. Temporary or additional transportation services to support social distancing to and from school",null,null,null,null,null,null,null,null,null,0]
["f. Capacity-building to improve disaster preparedness and response efforts, including coordination with public health departments",null,null,null,null,null,null,null,null,null,0]
{"$rows_left_out":16}
{"sheet":"Meeting Various Needs","index":3,"n_rows":28,"n_cols":11,"rows_kept":28,"cut":false,"hidden":false,"merged":[[24,3,24,4],[23,6,24,9],[22,6,22,9],[15,0,17,10],[0,0,0,2],[0,3,0,6],[20,1,20,4],[19,1,19,4]]}
[{"$f":"'LEA Background'!B3","v":"Please double check that you entered the correct ID number"},null,null,{"$f":"'Physical Health And Safety'!D1","v":0}]
["Expense Type","a. Personnel Services - Salaries","b. Personnel Services - Benefits","c. Purchased Professional and Technical Services","d. Purchased Property Services","e. Other Purchased Services","f. Supplies","g. Property","h. Debt Service and Miscellaneous","i. Other Items","Row Total"]
["h.1 Summer Learning or Summer Enrichment",null,null,null,null,null,null,null,null,null,{"$f":"SUM(B3:J3)","v":0}]
["h.2 Afterschool Programs",null,null,null,null,null,null,null,null,null,{"$f":"SUM(B4:J4)","v":0}]
["h.3 Extended instructional time (school day, school week, or school year)",null,null,null,null,null,null,null,null,null,0]
["i. Tutoring",null,null,null,null,null,null,null,null,null,{"$f":"SUM(B6:J6)","v":0}]
["j. Additional staffing and/or activities to identify and/or respond to unique student needs and/or provide targeted support for underserved student groups",null,null,null,null,null,null,null,null,null,0]
["k. Universal screening, academic assessments, and intervention data systems, such as early warning systems and/or opportunities to learn data systems",null,null,null,null,null,null,null,null,null,0]
{"$rows_left_out":21}
{"sheet":"Mental Health","index":4,"n_rows":17,"n_cols":11,"rows_kept":17,"cut":false,"hidden":false,"merged":[[13,3,13,4],[12,6,13,9],[0,0,0,2],[0,3,0,6],[11,6,11,9],[5,0,6,10],[9,1,9,4],[8,2,8,4]]}
[{"$f":"'LEA Background'!B3","v":"Please double check that you entered the correct ID number"},null,null,{"$f":"'Meeting Various Needs'!D1:G1","v":0}]
["Expense Type","a. Personnel Services - Salaries","b. Personnel Services - Benefits","c. Purchased Professional and Technical Services","d. Purchased Property Services","e. Other Purchased Services","f. Supplies","g. Property","h. Debt Service and Miscellaneous","i. Other Items","Total"]
["s. Additional staffing and/or activities to assess and support social-emotional well-being, including mental health, for students, educators and/or families"]
["Total",null,null,null,null,null,null,null,null,null,{"$f":"SUM(B3:J3)","v":0}]
[]
["If an expense doesn't fit one of the above descriptions, enter it into one of the other three tabs. The cells at the bottom of this sheet will track the total amount you've entered and will show the amount remaining to report"]
[]
[]
{"$rows_left_out":10}
{"sheet":"Other","index":5,"n_rows":22,"n_cols":11,"rows_kept":22,"cut":false,"hidden":false,"merged":[[18,3,18,4],[17,6,18,9],[0,0,0,2],[0,3,0,6],[16,6,16,9],[10,0,11,10],[14,1,14,4],[13,2,13,4]]}
[{"$f":"'LEA Background'!B3","v":"Please double check that you entered the correct ID number"},null,null,{"$f":"'Mental Health'!D1:G1","v":0}]
["Expense Type","a. Personnel Services - Salaries","b. Personnel Services - Benefits","c. Purchased Professional and Technical Services","d. Purchased Property Services","e. Other Purchased Services","f. Supplies","g. Property","h. Debt Service and Miscellaneous","i. Other Items","Row Total"]
["t. Any activity not described above that is authorized by the McKinney-Vento Homeless Assistance Act",null,null,null,null,null,null,null,null,null,{"$f":"SUM(B3:J3)","v":0}]
["u. Any activity not described above that is authorized by the Elementary and Secondary Education Act of 1965",null,null,null,null,null,null,null,null,null,{"$f":"SUM(B4:J4)","v":0}]
["v. Any activity not described above that is authorized by the Individuals with Disabilities Education Act",null,null,null,null,null,null,null,null,null,0]
["w. Any activity not described above that is authorized by the Adult Education and Family Literacy Act",null,null,null,null,null,null,null,null,null,0]
["w. Any activity not described above that is authorized by the Carl D. Perkins Career and Technical Education Act of 2006",null,null,null,null,null,null,null,null,null,0]
["y. Other activities not described above that are necessary to maintain the operation of and continuity of services in LEAs and continuing to employ existing staff of the LEA",null,null,null,null,null,null,null,null,null,0]
{"$rows_left_out":15}
{"sheet":"Summary","index":6,"n_rows":36,"n_cols":12,"rows_kept":36,"cut":false,"hidden":false,"merged":[[26,4,26,7],[25,0,25,3],[28,0,29,3],[30,0,32,3],[23,0,24,3],[19,0,21,1],[2,1,2,3],[3,1,3,3],[11,3,11,4],[26,0,27,3],[0,0,0,4],[19,3,19,4],[20,3,20,4],[7,0,7,1],[7,3,7,4],[11,0,11,1],[1,1,1,2],[6,0,6,4],[12,0,12,1],[9,3,10,3],[23,4,25,7],[13,5,17,7]]}
["SUMMARY"]
["State ID",{"$f":"'LEA Background'!C1","v":0}]
["LEA Name",{"$f":"'LEA Background'!B3","v":"Please double check that you entered the correct ID number"}]
["NCES #",{"$f":"'LEA Background'!B7","v":"Please double check that you entered the correct ID number"}]
[]
[null,null,"Subrant"]
[{"$f":"'LEA Background'!B16","v":0}]
["Reimbursed Summary:",null,null,"Remaining Funds Summary:"]
{"$rows_left_out":29}
{"sheet":"LEA Info","index":7,"n_rows":186,"n_cols":5,"rows_kept":186,"cut":false,"hidden":false,"merged":[]}
["ID","Name","DUNS","NCES","vendor"]
[58,"ABERDEEN DISTRICT",801867284,1600030,826000617]
[495,"ALTURAS INTERNATIONAL ACADEMY, INC.",71549639,1600175,473126055]
[560,"ALTURAS PREPARATORY ACADEMY, INC",36487482,1600199,853948402]
[381,"AMERICAN FALLS JOINT DISTRICT",144756442,1600060,826000865]
[482,"AMERICAN HERITAGE CHARTER SCHOOL, INC.",79082049,1600162,453753476]
[476,"ANOTHER CHOICE VIRTUAL CHARTER SCHOOL, INC.",966325438,1600155,263533892]
[492,"ANSER OF IDAHO, INC.",832063890,1600195,841390547]
{"$rows_left_out":179}
{"sheet":"Awarded","index":8,"n_rows":184,"n_cols":10,"rows_kept":184,"cut":false,"hidden":false,"merged":[]}
["ID","RecipientName","DUNS","CARES SA","CARES FT","CRRSA SA","CRRSA FT","ARP SA","ARP FT","ARP LL"]
[58,"ABERDEEN DISTRICT",801867284,16019.45,133884.35,0,503927.13,0,904805.38,226021.35]
[495,"ALTURAS INTERNATIONAL ACADEMY, INC.",71549639,14265.400000000001,52913.279999999999,30309.96,234551.48,0,421138.97,105201.33]
[560,"ALTURAS PREPARATORY ACADEMY, INC",36487482,0,0,0,96571.77,115011,173395.91,43314.78]
[381,"AMERICAN FALLS JOINT DISTRICT",144756442,27962.95,295973.63,0,1182846.05,0,2123808.8199999998,530530.30000000005]
[482,"AMERICAN HERITAGE CHARTER SCHOOL, INC.",79082049,12476.080000000002,24524.16,60969.05,132273.91,53776,237499.19,59327.62]
[492,"ANSER OF IDAHO, INC.",832063890,0,19499,54211.839999999997,145509.62,24223,261262.72,65263.78]
[383,"ARBON ELEMENTARY DISTRICT",189339153,8190.1900000000005,0,8579.48,0,349143,0,0]
{"$rows_left_out":177}
{"sheet":"Expended","index":9,"n_rows":184,"n_cols":21,"rows_kept":184,"cut":false,"hidden":false,"merged":[]}
["ID","NAME","Duns","Vendor","CARES Set Aside (LMS and SEL)","CARES Flow Through","CRRSA Set Aside","CRRSA Flow Through","ARP Set Aside","ARP Flow Through","ARP Learning Loss"]
[58,"ABERDEEN DISTRICT",801867284,826000617,8794.4500000000007,137.35,0,165547.34,0,425263.63999999996,116536.58,null,58,"ABERDEEN DISTRICT",8794.4500000000007,137.35,0,165547.34,0,425263.63999999996,116536.58]
[495,"ALTURAS INTERNATIONAL ACADEMY, INC.",71549639,473126055,11122.400000000001,54.28,30309.96,53349.9,0,378989.38,10251.9,null,495,"ALTURAS INTERNATIONAL ACADEMY, INC.",11122.400000000001,54.28,30309.96,53349.9,0,378989.38,10251.9]
[560,"ALTURAS PREPARATORY ACADEMY, INC",36487482,853948402,0,0,0,216.77,0,104017.26999999999,13823.36,null,560,"ALTURAS PREPARATORY ACADEMY, INC",0,0,0,216.77,0,104017.26999999999,13823.36]
[381,"AMERICAN FALLS JOINT DISTRICT",144756442,826000865,7315.83,303.63,0,100309.73999999999,0,1016601.29,108940.11,null,381,"AMERICAN FALLS JOINT DISTRICT",7315.83,303.63,0,100309.73999999999,0,1016601.29,108940.11]
[482,"AMERICAN HERITAGE CHARTER SCHOOL, INC.",79082049,453753476,441.08000000000004,52.04,60969.05,100844.2,53776,237499.19,29736.760000000002,null,482,"AMERICAN HERITAGE CHARTER SCHOOL, INC.",441.08000000000004,52.04,60969.05,100844.2,53776,237499.19,29736.760000000002]
[492,"ANSER OF IDAHO, INC.",832063890,841390547,0,0,43659.21,15468.32,6737.55,33025.94,0,null,492,"ANSER OF IDAHO, INC.",0,0,43659.21,15468.32,6737.55,33025.94,0]
[383,"ARBON ELEMENTARY DISTRICT",189339153,826003195,4032.19,0,332.34000000000003,0,94267.35,0,0,null,383,"ARBON ELEMENTARY DISTRICT",4032.19,0,332.34000000000003,0,94267.35,0,0]
{"$rows_left_out":177}
{"sheet":"Prior","index":10,"n_rows":186,"n_cols":11,"rows_kept":186,"cut":false,"hidden":false,"merged":[]}
["ID","Name","DUNS","vendor","CARES Set Aside (LMS and SEL)","CARES Flow Through","CRRSA Set Aside","CRRSA Flow Through","ARP Set Aside","ARP Flow Through","ARP Learning Loss"]
[58,"ABERDEEN DISTRICT",801867284,826000617,7225,133747,0,338379.79,0,479541.74,86565.35]
[495,"ALTURAS INTERNATIONAL ACADEMY, INC.",71549639,473126055,3143,52859,0,181201.58000000002,0,0,0]
[560,"ALTURAS PREPARATORY ACADEMY, INC",36487482,853948402,0,0,0,96355,0,41530.120000000003,4566.45]
[381,"AMERICAN FALLS JOINT DISTRICT",144756442,826000865,20647.12,295670,0,1082536.31,0,705325.07000000007,203355.12]
[482,"AMERICAN HERITAGE CHARTER SCHOOL, INC.",79082049,453753476,12035,24472.12,0,31429.71,0,0,0]
[492,"ANSER OF IDAHO, INC.",832063890,841390547,0,19479,0,128805.88,0,0,65126.95]
[383,"ARBON ELEMENTARY DISTRICT",189339153,826003195,4158,0,761.22,0,0,0,0]
{"$rows_left_out":179}
{"sheet":"Remaining","index":11,"n_rows":185,"n_cols":31,"rows_kept":185,"cut":false,"hidden":false,"merged":[]}
[null,null,null,"awarded",null,null,null,null,null,null,"Expended",null,null,null,null,null,null,"Prior",null,null,null,null,null,null,"Remaining"]
["ID","Name","DUNS","CARES Set Aside (LMS and SEL)","CARES Flow Through","CRRSA Set Aside","CRRSA Flow Through","ARP Set Aside","ARP Flow Through","ARP Learning Loss","CARES Set Aside (LMS and SEL)","CARES Flow Through","CRRSA Set Aside","CRRSA Flow Through","ARP Set Aside","ARP Flow Through","ARP Learning Loss","CARES Set Aside (LMS and SEL)","CARES Flow Through","CRRSA Set Aside","CRRSA Flow Through","ARP Set Aside","ARP Flow Through","ARP Learning Loss","CARES Set Aside (LMS and SEL)","CARES Flow Through","CRRSA Set Aside","CRRSA Flow Through","ARP Set Aside","ARP Flow Through","ARP Learning Loss"]
[58,"ABERDEEN DISTRICT",801867284,{"$f":"IFERROR(VLOOKUP($A3,Awarded!$A$2:$J$196,4,FALSE),0)","v":16019.45},{"$f":"IFERROR(VLOOKUP($A3,Awarded!$A$2:$J$196,5,FALSE),0)","v":133884.35},{"$f":"IFERROR(VLOOKUP($A3,Awarded!$A$2:$J$196,6,FALSE),0)","v":0},{"$f":"IFERROR(VLOOKUP($A3,Awarded!$A$2:$J$196,7,FALSE),0)","v":503927.13},{"$f":"IFERROR(VLOOKUP($A3,Awarded!$A$2:$J$196,8,FALSE),0)","v":0},{"$f":"IFERROR(VLOOKUP($A3,Awarded!$A$2:$J$196,9,FALSE),0)","v":904805.38},{"$f":"IFERROR(VLOOKUP($A3,Awarded!$A$2:$J$196,10,FALSE),0)","v":226021.35},{"$f":"IFERROR(VLOOKUP($A3,Expended!$A$2:$J$198,5,FALSE),0)","v":8794.4500000000007},{"$f":"IFERROR(VLOOKUP($A3,Expended!$A$2:$J$198,6,FALSE),0)","v":137.35},{"$f":"IFERROR(VLOOKUP($A3,Expended!$A$2:$J$198,7,FALSE),0)","v":0},{"$f":"IFERROR(VLOOKUP($A3,Expended!$A$2:$J$198,8,FALSE),0)","v":165547.34},{"$f":"IFERROR(VLOOKUP($A3,Expended!$A$2:$J$198,9,FALSE),0)","v":0},{"$f":"IFERROR(VLOOKUP($A3,Expended!$A$2:$J$198,10,FALSE),0)","v":425263.63999999996},{"$f":"IFERROR(VLOOKUP($A3,Expended!$A$2:$L$198,11,FALSE),0)","v":116536.58},{"$f":"VLOOKUP($A3,Prior!$A$1:$K$199,5,FALSE)","v":7225},{"$f":"VLOOKUP($A3,Prior!$A$1:$K$199,6,FALSE)","v":133747},{"$f":"VLOOKUP($A3,Prior!$A$1:$K$199,7,FALSE)","v":0},{"$f":"VLOOKUP($A3,Prior!$A$1:$K$199,8,FALSE)","v":338379.79},{"$f":"VLOOKUP($A3,Prior!$A$1:$K$199,9,FALSE)","v":0},{"$f":"VLOOKUP($A3,Prior!$A$1:$K$199,10,FALSE)","v":479541.74},{"$f":"VLOOKUP($A3,Prior!$A$1:$K$199,11,FALSE)","v":86565.35},{"$f":"D3-K3-R3","v":0},{"$f":"E3-L3-S3","v":0},{"$f":"F3-M3-T3","v":0},{"$f":"G3-N3-U3","v":0},{"$f":"H3-O3-V3","v":0},{"$f":"I3-P3-W3","v":0},{"$f":"J3-Q3-X3","v":22919.42}]
[495,"ALTURAS INTERNATIONAL ACADEMY, INC.",71549639,{"$f":"IFERROR(VLOOKUP($A4,Awarded!$A$2:$J$196,4,FALSE),0)","v":14265.400000000001},{"$f":"IFERROR(VLOOKUP($A4,Awarded!$A$2:$J$196,5,FALSE),0)","v":52913.279999999999},{"$f":"IFERROR(VLOOKUP($A4,Awarded!$A$2:$J$196,6,FALSE),0)","v":30309.96},{"$f":"IFERROR(VLOOKUP($A4,Awarded!$A$2:$J$196,7,FALSE),0)","v":234551.48},{"$f":"IFERROR(VLOOKUP($A4,Awarded!$A$2:$J$196,8,FALSE),0)","v":0},{"$f":"IFERROR(VLOOKUP($A4,Awarded!$A$2:$J$196,9,FALSE),0)","v":421138.97},{"$f":"IFERROR(VLOOKUP($A4,Awarded!$A$2:$J$196,10,FALSE),0)","v":105201.33},{"$f":"IFERROR(VLOOKUP($A4,Expended!$A$2:$J$198,5,FALSE),0)","v":11122.400000000001},{"$f":"IFERROR(VLOOKUP($A4,Expended!$A$2:$J$198,6,FALSE),0)","v":54.28},{"$f":"IFERROR(VLOOKUP($A4,Expended!$A$2:$J$198,7,FALSE),0)","v":30309.96},{"$f":"IFERROR(VLOOKUP($A4,Expended!$A$2:$J$198,8,FALSE),0)","v":53349.9},{"$f":"IFERROR(VLOOKUP($A4,Expended!$A$2:$J$198,9,FALSE),0)","v":0},{"$f":"IFERROR(VLOOKUP($A4,Expended!$A$2:$J$198,10,FALSE),0)","v":378989.38},{"$f":"IFERROR(VLOOKUP($A4,Expended!$A$2:$L$198,11,FALSE),0)","v":10251.9},{"$f":"VLOOKUP($A4,Prior!$A$1:$K$199,5,FALSE)","v":3143},{"$f":"VLOOKUP($A4,Prior!$A$1:$K$199,6,FALSE)","v":52859},{"$f":"VLOOKUP($A4,Prior!$A$1:$K$199,7,FALSE)","v":0},{"$f":"VLOOKUP($A4,Prior!$A$1:$K$199,8,FALSE)","v":181201.58000000002},{"$f":"VLOOKUP($A4,Prior!$A$1:$K$199,9,FALSE)","v":0},{"$f":"VLOOKUP($A4,Prior!$A$1:$K$199,10,FALSE)","v":0},{"$f":"VLOOKUP($A4,Prior!$A$1:$K$199,11,FALSE)","v":0},0,0,0,0,0,42149.589999999967,94949.430000000008]
[560,"ALTURAS PREPARATORY ACADEMY, INC",36487482,{"$f":"IFERROR(VLOOKUP($A5,Awarded!$A$2:$J$196,4,FALSE),0)","v":0},{"$f":"IFERROR(VLOOKUP($A5,Awarded!$A$2:$J$196,5,FALSE),0)","v":0},{"$f":"IFERROR(VLOOKUP($A5,Awarded!$A$2:$J$196,6,FALSE),0)","v":0},{"$f":"IFERROR(VLOOKUP($A5,Awarded!$A$2:$J$196,7,FALSE),0)","v":96571.77},{"$f":"IFERROR(VLOOKUP($A5,Awarded!$A$2:$J$196,8,FALSE),0)","v":115011},{"$f":"IFERROR(VLOOKUP($A5,Awarded!$A$2:$J$196,9,FALSE),0)","v":173395.91},{"$f":"IFERROR(VLOOKUP($A5,Awarded!$A$2:$J$196,10,FALSE),0)","v":43314.78},{"$f":"IFERROR(VLOOKUP($A5,Expended!$A$2:$J$198,5,FALSE),0)","v":0},{"$f":"IFERROR(VLOOKUP($A5,Expended!$A$2:$J$198,6,FALSE),0)","v":0},{"$f":"IFERROR(VLOOKUP($A5,Expended!$A$2:$J$198,7,FALSE),0)","v":0},{"$f":"IFERROR(VLOOKUP($A5,Expended!$A$2:$J$198,8,FALSE),0)","v":216.77},{"$f":"IFERROR(VLOOKUP($A5,Expended!$A$2:$J$198,9,FALSE),0)","v":0},{"$f":"IFERROR(VLOOKUP($A5,Expended!$A$2:$J$198,10,FALSE),0)","v":104017.26999999999},{"$f":"IFERROR(VLOOKUP($A5,Expended!$A$2:$L$198,11,FALSE),0)","v":13823.36},{"$f":"VLOOKUP($A5,Prior!$A$1:$K$199,5,FALSE)","v":0},{"$f":"VLOOKUP($A5,Prior!$A$1:$K$199,6,FALSE)","v":0},{"$f":"VLOOKUP($A5,Prior!$A$1:$K$199,7,FALSE)","v":0},{"$f":"VLOOKUP($A5,Prior!$A$1:$K$199,8,FALSE)","v":96355},{"$f":"VLOOKUP($A5,Prior!$A$1:$K$199,9,FALSE)","v":0},{"$f":"VLOOKUP($A5,Prior!$A$1:$K$199,10,FALSE)","v":41530.120000000003},{"$f":"VLOOKUP($A5,Prior!$A$1:$K$199,11,FALSE)","v":4566.45},0,0,0,0,115011,27848.520000000011,24924.969999999998]
[381,"AMERICAN FALLS JOINT DISTRICT",144756442,{"$f":"IFERROR(VLOOKUP($A6,Awarded!$A$2:$J$196,4,FALSE),0)","v":27962.95},{"$f":"IFERROR(VLOOKUP($A6,Awarded!$A$2:$J$196,5,FALSE),0)","v":295973.63},{"$f":"IFERROR(VLOOKUP($A6,Awarded!$A$2:$J$196,6,FALSE),0)","v":0},{"$f":"IFERROR(VLOOKUP($A6,Awarded!$A$2:$J$196,7,FALSE),0)","v":1182846.05},{"$f":"IFERROR(VLOOKUP($A6,Awarded!$A$2:$J$196,8,FALSE),0)","v":0},{"$f":"IFERROR(VLOOKUP($A6,Awarded!$A$2:$J$196,9,FALSE),0)","v":2123808.8199999998},{"$f":"IFERROR(VLOOKUP($A6,Awarded!$A$2:$J$196,10,FALSE),0)","v":530530.30000000005},{"$f":"IFERROR(VLOOKUP($A6,Expended!$A$2:$J$198,5,FALSE),0)","v":7315.83},{"$f":"IFERROR(VLOOKUP($A6,Expended!$A$2:$J$198,6,FALSE),0)","v":303.63},{"$f":"IFERROR(VLOOKUP($A6,Expended!$A$2:$J$198,7,FALSE),0)","v":0},{"$f":"IFERROR(VLOOKUP($A6,Expended!$A$2:$J$198,8,FALSE),0)","v":100309.73999999999},{"$f":"IFERROR(VLOOKUP($A6,Expended!$A$2:$J$198,9,FALSE),0)","v":0},{"$f":"IFERROR(VLOOKUP($A6,Expended!$A$2:$J$198,10,FALSE),0)","v":1016601.29},{"$f":"IFERROR(VLOOKUP($A6,Expended!$A$2:$L$198,11,FALSE),0)","v":108940.11},{"$f":"VLOOKUP($A6,Prior!$A$1:$K$199,5,FALSE)","v":20647.12},{"$f":"VLOOKUP($A6,Prior!$A$1:$K$199,6,FALSE)","v":295670},{"$f":"VLOOKUP($A6,Prior!$A$1:$K$199,7,FALSE)","v":0},{"$f":"VLOOKUP($A6,Prior!$A$1:$K$199,8,FALSE)","v":1082536.31},{"$f":"VLOOKUP($A6,Prior!$A$1:$K$199,9,FALSE)","v":0},{"$f":"VLOOKUP($A6,Prior!$A$1:$K$199,10,FALSE)","v":705325.07000000007},{"$f":"VLOOKUP($A6,Prior!$A$1:$K$199,11,FALSE)","v":203355.12},0,0,0,0,0,401882.45999999973,218235.07000000007]
[482,"AMERICAN HERITAGE CHARTER SCHOOL, INC.",79082049,{"$f":"IFERROR(VLOOKUP($A7,Awarded!$A$2:$J$196,4,FALSE),0)","v":12476.080000000002},{"$f":"IFERROR(VLOOKUP($A7,Awarded!$A$2:$J$196,5,FALSE),0)","v":24524.16},{"$f":"IFERROR(VLOOKUP($A7,Awarded!$A$2:$J$196,6,FALSE),0)","v":60969.05},{"$f":"IFERROR(VLOOKUP($A7,Awarded!$A$2:$J$196,7,FALSE),0)","v":132273.91},{"$f":"IFERROR(VLOOKUP($A7,Awarded!$A$2:$J$196,8,FALSE),0)","v":53776},{"$f":"IFERROR(VLOOKUP($A7,Awarded!$A$2:$J$196,9,FALSE),0)","v":237499.19},{"$f":"IFERROR(VLOOKUP($A7,Awarded!$A$2:$J$196,10,FALSE),0)","v":59327.62},{"$f":"IFERROR(VLOOKUP($A7,Expended!$A$2:$J$198,5,FALSE),0)","v":441.08000000000004},{"$f":"IFERROR(VLOOKUP($A7,Expended!$A$2:$J$198,6,FALSE),0)","v":52.04},{"$f":"IFERROR(VLOOKUP($A7,Expended!$A$2:$J$198,7,FALSE),0)","v":60969.05},{"$f":"IFERROR(VLOOKUP($A7,Expended!$A$2:$J$198,8,FALSE),0)","v":100844.2},{"$f":"IFERROR(VLOOKUP($A7,Expended!$A$2:$J$198,9,FALSE),0)","v":53776},{"$f":"IFERROR(VLOOKUP($A7,Expended!$A$2:$J$198,10,FALSE),0)","v":237499.19},{"$f":"IFERROR(VLOOKUP($A7,Expended!$A$2:$L$198,11,FALSE),0)","v":29736.760000000002},{"$f":"VLOOKUP($A7,Prior!$A$1:$K$199,5,FALSE)","v":12035},{"$f":"VLOOKUP($A7,Prior!$A$1:$K$199,6,FALSE)","v":24472.12},{"$f":"VLOOKUP($A7,Prior!$A$1:$K$199,7,FALSE)","v":0},{"$f":"VLOOKUP($A7,Prior!$A$1:$K$199,8,FALSE)","v":31429.71},{"$f":"VLOOKUP($A7,Prior!$A$1:$K$199,9,FALSE)","v":0},{"$f":"VLOOKUP($A7,Prior!$A$1:$K$199,10,FALSE)","v":0},{"$f":"VLOOKUP($A7,Prior!$A$1:$K$199,11,FALSE)","v":0},0,0,0,0,0,0,29590.86]
[492,"ANSER OF IDAHO, INC.",832063890,{"$f":"IFERROR(VLOOKUP($A8,Awarded!$A$2:$J$196,4,FALSE),0)","v":0},{"$f":"IFERROR(VLOOKUP($A8,Awarded!$A$2:$J$196,5,FALSE),0)","v":19499},{"$f":"IFERROR(VLOOKUP($A8,Awarded!$A$2:$J$196,6,FALSE),0)","v":54211.839999999997},{"$f":"IFERROR(VLOOKUP($A8,Awarded!$A$2:$J$196,7,FALSE),0)","v":145509.62},{"$f":"IFERROR(VLOOKUP($A8,Awarded!$A$2:$J$196,8,FALSE),0)","v":24223},{"$f":"IFERROR(VLOOKUP($A8,Awarded!$A$2:$J$196,9,FALSE),0)","v":261262.72},{"$f":"IFERROR(VLOOKUP($A8,Awarded!$A$2:$J$196,10,FALSE),0)","v":65263.78},{"$f":"IFERROR(VLOOKUP($A8,Expended!$A$2:$J$198,5,FALSE),0)","v":0},{"$f":"IFERROR(VLOOKUP($A8,Expended!$A$2:$J$198,6,FALSE),0)","v":0},{"$f":"IFERROR(VLOOKUP($A8,Expended!$A$2:$J$198,7,FALSE),0)","v":43659.21},{"$f":"IFERROR(VLOOKUP($A8,Expended!$A$2:$J$198,8,FALSE),0)","v":15468.32},{"$f":"IFERROR(VLOOKUP($A8,Expended!$A$2:$J$198,9,FALSE),0)","v":6737.55},{"$f":"IFERROR(VLOOKUP($A8,Expended!$A$2:$J$198,10,FALSE),0)","v":33025.94},{"$f":"IFERROR(VLOOKUP($A8,Expended!$A$2:$L$198,11,FALSE),0)","v":0},{"$f":"VLOOKUP($A8,Prior!$A$1:$K$199,5,FALSE)","v":0},{"$f":"VLOOKUP($A8,Prior!$A$1:$K$199,6,FALSE)","v":19479},{"$f":"VLOOKUP($A8,Prior!$A$1:$K$199,7,FALSE)","v":0},{"$f":"VLOOKUP($A8,Prior!$A$1:$K$199,8,FALSE)","v":128805.88},{"$f":"VLOOKUP($A8,Prior!$A$1:$K$199,9,FALSE)","v":0},{"$f":"VLOOKUP($A8,Prior!$A$1:$K$199,10,FALSE)","v":0},{"$f":"VLOOKUP($A8,Prior!$A$1:$K$199,11,FALSE)","v":65126.95},0,20,10552.629999999997,1235.4199999999837,17485.45,228236.78,136.83000000000175]
{"$rows_left_out":177}