{"text_format":"1","workbook":"xlsx","n_sheets":12,"sheets":["Instructions","LEA Background","Physical Health And Safety","Meeting Various Needs","Mental Health","Other","Summary","LEA Info","Awarded","Expended","Prior","Remaining"],"not_rendered":{"charts":0,"images":3,"macros":1,"external_links":0,"defined_names":6,"comments":2,"pivot_tables":0},"unopened":[],"bounds":{"document_bytes":16777216,"sheet_cells":100000,"rows_first":2000,"rows_last":500,"rows_between":2000,"halvings":0,"cell_chars":16384,"cell_head_chars":4096},"cells_cut":0,"cells_raw":0,"read":"whole","date_system":"1900"}

{"sheet":"Instructions","index":0,"n_rows":68,"n_cols":13,"rows_kept":68,"cut":false,"hidden":false,"merged":[[60,3,61,10],[64,3,65,10],[67,3,69,10],[61,12,61,16],[57,3,57,10],[55,4,55,6],[46,6,46,8],[43,3,45,11],[47,3,48,11],[29,3,30,11],[31,3,32,11],[40,3,42,11],[0,0,2,12],[26,3,26,11],[51,3,52,11],[53,4,53,8],[54,4,54,13]]}
["While you still need to submit information into the online reporting site, this workbook is intended to be a resource to help you in organizing ESSER expenses. If you have any questions, feel free to contact SDE. This first tab will show you how to use this workbook, though do not feel obligated to use this as SDE will only accept information submitted through the online site"]
[]
[]
[null,null,"You first will go to the \"LEA Background\" tab at the bottom of the screen:"]
[]
[]
[]
[]
[]
[]
[]
[]
[]
[]
[]
[]
[]
[]
[]
[]
[]
[]
[]
[]
[]
[]
[null,null,null,"You'll then report on expenses in each of the next four tabs at the bottom of the screen:"]
[null,null,null,"Physical Health and Safey",null,null,"Meeting Various Needs",null,null,"Mental Health",null,"Other"]
[]
[null,null,null,"In each of those you will fill out the template to match USED reporting guidelines. The amounts will be used to populate the \"Summary\" tab for validation checks"]
[]
[null,null,null,"At the bottom of each, you will see information about the total amount that needs to be accounted for, the amounts you've entered, and the difference (if applicable)"]
[]
[]
[]
[]
[]
[]
[]
[]
[null,null,null,"All of these are auto filled, no need to manually edit them. They will reference the information you've entered in each template so you don't need to jump back-and-forth between the tabs to track how much you've entered"]
[]
[]
[null,null,null,"Due to the large amount of formulas used in the workbook to populate the information, most cells will be locked for edits. The responses entered in cells highlighted in orange will be referenced for validation checks"]
[]
[]
[null,null,null,null,null,null,"Example of cell you can edit"]
[null,null,null,"The remaining five tabs are used to populate this workbook and do not need to be reviewed, edited, or require input. They will be locked for edits"]
[]
[null,null,null,"LEA Info","Awarded","Expended","Prior","Remaining"]
[]
[null,null,null,"If you want to fill this out for multiple sub grants, it is recommended you save this workbook under a different name (macro-enabled). You then have three options:"]
[]
[null,null,null,null,"1. Download another blank workbook OR"]
[null,null,null,null,"2. Select the \"Erase Entries\" option in the Summary tab OR"]
[null,null,null,null,"3. Delete all previous entries"]
[]
[null,null,null,"If you are ever unsure of what you have left to report, check the Summary tab"]
[]
[null,null,null,"If you have entered everything correctly, you will see this note:"]
[null,null,null,"No validation errors, you have entered all necessary information needed for this subgrant. Friendly reminder to work on any other sugbrant, if needed"]
[null,null,null,null,null,null,null,null,null,null,null,null,"Link to reporting site (available December 4th, 2023)"]
[null,null,null,null,null,null,null,null,null,null,null,null,"https://idahoessercollection.mtwgms.org/melody/"]
[null,null,null,"If there are errors, or if additional information is needed, you will see this error:"]
[null,null,null,"Please review the Reimbursed and/or Remaining Funds Summaries for needed information"]
[]
[]
[null,null,null,"As this is an optional resource, if at any point it is giving you difficulty, feel free to try your own method of tracking/recording your ESSER expenses. But remember that SDE will only accept submissions through the reporting site"]

{"sheet":"LEA Background","index":1,"n_rows":30,"n_cols":12,"rows_kept":30,"cut":false,"hidden":false,"merged":[[1,1,1,2],[5,1,5,2],[23,1,25,3],[8,1,11,2],[2,1,4,2],[6,1,7,2],[12,1,12,2],[15,1,15,3],[14,1,14,3],[17,1,19,1],[17,2,19,2],[17,3,19,3],[20,1,20,3],[21,1,22,1],[21,3,22,3],[21,2,22,2]]}
[null,"Please enter your LEA State ID in cell C1:",null,"*Check the \"LEA Info\" tab if you need help finding your ID; will only be three digits"]
[null,"Your LEA Name:"]
[null,{"$f":"IFERROR(VLOOKUP($C$1,'LEA Info'!$A$2:$D$200,2,FALSE),\"Please double check that you entered the correct ID number\")","v":"Please double check that you entered the correct ID number"}]
[null,null,null," "]
[]
[null,"Your LEA NCES Number:"]
[null,{"$f":"IFERROR(VLOOKUP($C$1,'LEA Info'!$A$2:$D$200,4,FALSE),\"Please double check that you entered the correct ID number\")","v":"Please double check that you entered the correct ID number"}]
[]
[null,"Pease verify the information shown is accurate before continuing. The exact Name of you LEA shown is based on GRA reports. As long as the state ID and NCES numbers are accurate, the financial information should be correct"]
[]
[]
[null,null,null,"Select which grant you will work on:"]
[null,"Click on cell D13 to show the arrow. Click on the arrow to show the list of subgrants"]
[]
[null,"As of June 30th, 2023"]
[null,{"$f":"D13","v":0}]
[null,"Awarded","Reimbursed in Current Reporting Period (July 1st, 2022 - June 30th, 2023)","Remaining Balance"]
[null,{"$f":"IFERROR(VLOOKUP($C$1,Awarded!$A$1:$J$195,L22+3,FALSE),0)","v":0},{"$f":"IFERROR(VLOOKUP($C$1,Expended!$A$1:$K$196,L22+4,FALSE),0)","v":0},{"$f":"IFERROR(VLOOKUP($C$1,Remaining!$A$1:$AE$195,L22+24,FALSE),0)","v":0}]
[]
[]
[null,"Notes"]
[null,{"$f":"IF(AND(C1>0,B18=0),\"No Awarded Amount, no information needed. You may start working on another subgrant\",\"\")","v":""},{"$f":"IF(B18=0,\"\",IF(C18=0,\"No Prior Reimbursements to report\",\"Please report on how these funds were used by filling out the next four tabs\"))","v":""},{"$f":"IF(AND(L22<3,D18>0),\"No need to report on remaining CARES Funds\",IF(D18>0,\"Please report on planned usage of remaining funds in the Summary Tab\",\"\"))","v":{"$error":"#N/A"}},null,null,null,null,null,null,"Reference",{"$f":"VLOOKUP(D13,$K$23:$L$29,2,FALSE)","v":{"$error":"#N/A"}}]
[null,null,null,null,null,null,null,null,null,null,"CARES Set Aside (LMS and SEL)",1]
[null,{"$f":"IF(B30=FALSE,IF(OR(C30=FALSE,D30=FALSE),\"\",\"No Information to Report for this Subgrant in this Reporting Period; Please begin working on another subgrant, if needed\"),\"\")","v":""},null,null,null,null,null,null,null,null,"CARES Flow Through",2]
[null,null,null,null,null,null,null,null,null,null,"CRRSA Set Aside",3]
[null,null,null,null,null,null,null,null,null,null,"CRRSA Flow Through",4]
[null,null,null,null,null,null,null,null,null,null,"ARP Set Aside",5]
[null,null,null,null,null,null,null,null,null,null,"ARP Flow Through",6]
[null,null,null,null,null,null,null,null,null,null,"ARP Learning Loss",7]
[null,{"$f":"IF(B18=0,TRUE,FALSE)","v":true},{"$f":"IF(B18=0,TRUE,IF(C18=0,TRUE,FALSE))","v":true},{"$f":"IF(L22<3,TRUE,IF(D18=0,TRUE,FALSE))","v":{"$error":"#N/A"}}]

{"sheet":"Physical Health And Safety","index":2,"n_rows":23,"n_cols":11,"rows_kept":23,"cut":false,"hidden":false,"merged":[[19,3,19,4],[14,1,14,4],[18,6,19,9],[0,0,0,2],[0,3,0,6],[17,6,17,9],[11,0,12,10],[15,1,15,4]]}
[{"$f":"'LEA Background'!B3","v":"Please double check that you entered the correct ID number"},null,null,{"$f":"'LEA Background'!B16","v":0}]
["Expense Type","a. Personnel Services - Salaries","b. Personnel Services - Benefits","c. Purchased Professional and Technical Services","d. Purchased Property Services","e. Other Purchased Services","f. Supplies","g. Property","h. Debt Service and Miscellaneous","i. Other Items","Row Total"]
["a. Building and facilities upgrades and maintenance, including ventilation systems and new construction",null,null,null,null,null,null,null,null,null,{"$f":"SUM(B3:J3)","v":0}]
["b. Assistance with meals for students",null,null,null,null,null,null,null,null,null,{"$f":"SUM(B4:J4)","v":0}]
["c. Cleaning and/or sanitization supplies",null,null,null,null,null,null,null,null,null,0]
["d. Temporary classroom space to support social distancing",null,null,null,null,null,null,null,null,null,0]
["e. Temporary or additional transportation services to support social distancing to and from school",null,null,null,null,null,null,null,null,null,0]
["f. Capacity-building to improve disaster preparedness and response efforts, including coordination with public health departments",null,null,null,null,null,null,null,null,null,0]
["g. Other health protocols not listed above and aligned to guidance from the Centers for Disease Control and Prevention (CDC)",null,null,null,null,null,null,null,null,null,0]
["Column Total",{"$f":"SUM(B3:B9)","v":0},{"$f":"SUM(C3:C9)","v":0},0,0,0,0,0,0,0,{"$f":"SUM(B3:J9)","v":0}]
[]
["If an expense doesn't fit one of the above descriptions, enter it into one of the other three tabs. The cells at the bottom of this sheet will track the all entries across all four tabs, including the amount left to report on"]
[]
[]
[null,"Reimbursed Amount (Exact amount to report)",null,null,null,{"$f":"'LEA Background'!$C$18","v":0}]
[null,"Amounts Entered in all Tabs"]
[null,"Physical Health and Safety","Meeting Various Needs","Mental Health","Other","Total Entered"]
[null,{"$f":"K10","v":0},{"$f":"'Meeting Various Needs'!K14","v":0},{"$f":"'Mental Health'!K4","v":0},{"$f":"Other!K9","v":0},{"$f":"Summary!B$18","v":0},"Warnings:"]
[null,null,null,null,null,null,{"$f":"IF(F$20<0,\"Double check that you haven't overreported in one of the templates\",\"NA\")","v":"NA"}]
[null,null,null,"Amount remaining to report",null,{"$f":"F15-F18","v":0}]
[]
[null,"a. Personnel Services - Salaries","b. Personnel Services - Benefits","c. Purchased Professional and Technical Services","d. Purchased Property Services","e. Other Purchased Services","f. Supplies","g. Property","h. Debt Service and Miscellaneous","i. Other Items"]
[null,{"$f":"B10+'Meeting Various Needs'!B14+'Mental Health'!B3+Other!B9","v":0},{"$f":"C10+'Meeting Various Needs'!C14+'Mental Health'!C3+Other!C9","v":0},{"$f":"D10+'Meeting Various Needs'!D14+'Mental Health'!D3+Other!D9","v":0},{"$f":"E10+'Meeting Various Needs'!E14+'Mental Health'!E3+Other!E9","v":0},{"$f":"F10+'Meeting Various Needs'!F14+'Mental Health'!F3+Other!F9","v":0},{"$f":"G10+'Meeting Various Needs'!G14+'Mental Health'!G3+Other!G9","v":0},{"$f":"H10+'Meeting Various Needs'!H14+'Mental Health'!H3+Other!H9","v":0},{"$f":"I10+'Meeting Various Needs'!I14+'Mental Health'!I3+Other!I9","v":0},{"$f":"J10+'Meeting Various Needs'!J14+'Mental Health'!J3+Other!J9","v":0}]

{"sheet":"Meeting Various Needs","index":3,"n_rows":28,"n_cols":11,"rows_kept":28,"cut":false,"hidden":false,"merged":[[24,3,24,4],[23,6,24,9],[22,6,22,9],[15,0,17,10],[0,0,0,2],[0,3,0,6],[20,1,20,4],[19,1,19,4]]}
[{"$f":"'LEA Background'!B3","v":"Please double check that you entered the correct ID number"},null,null,{"$f":"'Physical Health And Safety'!D1","v":0}]
["Expense Type","a. Personnel Services - Salaries","b. Personnel Services - Benefits","c. Purchased Professional and Technical Services","d. Purchased Property Services","e. Other Purchased Services","f. Supplies","g. Property","h. Debt Service and Miscellaneous","i. Other Items","Row Total"]
["h.1 Summer Learning or Summer Enrichment",null,null,null,null,null,null,null,null,null,{"$f":"SUM(B3:J3)","v":0}]
["h.2 Afterschool Programs",null,null,null,null,null,null,null,null,null,{"$f":"SUM(B4:J4)","v":0}]
["h.3 Extended instructional time (school day, school week, or school year)",null,null,null,null,null,null,null,null,null,0]
["i. Tutoring",null,null,null,null,null,null,null,null,null,{"$f":"SUM(B6:J6)","v":0}]
["j. Additional staffing and/or activities to identify and/or respond to unique student needs and/or provide targeted support for underserved student groups",null,null,null,null,null,null,null,null,null,0]
["k. Universal screening, academic assessments, and intervention data systems, such as early warning systems and/or opportunities to learn data systems",null,null,null,null,null,null,null,null,null,0]
["l. Improved coordination of services for students with multiple types of needs",null,null,null,null,null,null,null,null,null,0]
["m. Early Childhood Programs",null,null,null,null,null,null,null,null,null,0]
["n. Hardware and software",null,null,null,null,null,null,null,null,null,0]
["o. Wi-Fi, broadband, or other connectivity",null,null,null,null,null,null,null,null,null,0]
["p. Curriculum adoption and learning materials",null,null,null,null,null,null,null,null,null,0]
[null,{"$f":"SUM(B3:B13)","v":0},{"$f":"SUM(C3:C13)","v":0},0,0,0,0,0,0,0,{"$f":"SUM(B3:J13)","v":0}]
[]
["If an expense doesn't fit one of the above descriptions, enter it into one of the other three tabs. The cells at the bottom of this sheet will track the total amount you've entered and will show the amount remaining to report"]
[]
[]
[]
[null,"Reimbursed Amount (Exact amount to report)",null,null,null,{"$f":"'LEA Background'!$C$18","v":0}]
[null,"Amounts Entered in each Tab"]
[null,"Physical Health and Safety","Meeting Various Needs","Mental Health","Other","Total Reported"]
[null,{"$f":"'Physical Health And Safety'!K10","v":0},{"$f":"K14","v":0},{"$f":"'Mental Health'!K4","v":0},{"$f":"Other!K9","v":0},{"$f":"Summary!B$18","v":0},"Warnings:"]
[null,null,null,null,null,null,{"$f":"IF(F$25<0,\"Double check that you haven't overreported in one of the templates\",\"NA\")","v":"NA"}]
[null,null,null,"Amount remaining to report",null,{"$f":"F20-F23","v":0}]
[]
[null,"a. Personnel Services - Salaries","b. Personnel Services - Benefits","c. Purchased Professional and Technical Services","d. Purchased Property Services","e. Other Purchased Services","f. Supplies","g. Property","h. Debt Service and Miscellaneous","i. Other Items"]
[null,{"$f":"'Physical Health And Safety'!B23","v":0},{"$f":"'Physical Health And Safety'!C23","v":0},{"$f":"'Physical Health And Safety'!D23","v":0},{"$f":"'Physical Health And Safety'!E23","v":0},{"$f":"'Physical Health And Safety'!F23","v":0},{"$f":"'Physical Health And Safety'!G23","v":0},{"$f":"'Physical Health And Safety'!H23","v":0},{"$f":"'Physical Health And Safety'!I23","v":0},{"$f":"'Physical Health And Safety'!J23","v":0}]

{"sheet":"Mental Health","index":4,"n_rows":17,"n_cols":11,"rows_kept":17,"cut":false,"hidden":false,"merged":[[13,3,13,4],[12,6,13,9],[0,0,0,2],[0,3,0,6],[11,6,11,9],[5,0,6,10],[9,1,9,4],[8,2,8,4]]}
[{"$f":"'LEA Background'!B3","v":"Please double check that you entered the correct ID number"},null,null,{"$f":"'Meeting Various Needs'!D1:G1","v":0}]
["Expense Type","a. Personnel Services - Salaries","b. Personnel Services - Benefits","c. Purchased Professional and Technical Services","d. Purchased Property Services","e. Other Purchased Services","f. Supplies","g. Property","h. Debt Service and Miscellaneous","i. Other Items","Total"]
["s. Additional staffing and/or activities to assess and support social-emotional well-being, including mental health, for students, educators and/or families"]
["Total",null,null,null,null,null,null,null,null,null,{"$f":"SUM(B3:J3)","v":0}]
[]
["If an expense doesn't fit one of the above descriptions, enter it into one of the other three tabs. The cells at the bottom of this sheet will track the total amount you've entered and will show the amount remaining to report"]
[]
[]
[null,null,"Reimbursed Amount (Exact amount to report)",null,null,{"$f":"'LEA Background'!$C$18","v":0}]
[null,"Amounts Entered in all Tabs"]
[null,"Physical Health and Safety","Meeting Various Needs","Mental Health","Other","Total Reported"]
[null,{"$f":"'Physical Health And Safety'!K10","v":0},{"$f":"'Meeting Various Needs'!K14","v":0},{"$f":"K4","v":0},{"$f":"Other!K9","v":0},{"$f":"Summary!B18","v":0},"Warnings"]
[null,null,null,null,null,null,{"$f":"IF(F$14<0,\"Double check that you haven't overreported in one of the tabs\",\"NA\")","v":"NA"}]
[null,null,null,"Amount remaining to report",null,{"$f":"F9-F12","v":0}]
[]
[null,"a. Personnel Services - Salaries","b. Personnel Services - Benefits","c. Purchased Professional and Technical Services","d. Purchased Property Services","e. Other Purchased Services","f. Supplies","g. Property","h. Debt Service and Miscellaneous","i. Other Items"]
[null,{"$f":"'Meeting Various Needs'!B28","v":0},{"$f":"'Meeting Various Needs'!C28","v":0},{"$f":"'Meeting Various Needs'!D28","v":0},{"$f":"'Meeting Various Needs'!E28","v":0},{"$f":"'Meeting Various Needs'!F28","v":0},{"$f":"'Meeting Various Needs'!G28","v":0},{"$f":"'Meeting Various Needs'!H28","v":0},{"$f":"'Meeting Various Needs'!I28","v":0},{"$f":"'Meeting Various Needs'!J28","v":0}]

{"sheet":"Other","index":5,"n_rows":22,"n_cols":11,"rows_kept":22,"cut":false,"hidden":false,"merged":[[18,3,18,4],[17,6,18,9],[0,0,0,2],[0,3,0,6],[16,6,16,9],[10,0,11,10],[14,1,14,4],[13,2,13,4]]}
[{"$f":"'LEA Background'!B3","v":"Please double check that you entered the correct ID number"},null,null,{"$f":"'Mental Health'!D1:G1","v":0}]
["Expense Type","a. Personnel Services - Salaries","b. Personnel Services - Benefits","c. Purchased Professional and Technical Services","d. Purchased Property Services","e. Other Purchased Services","f. Supplies","g. Property","h. Debt Service and Miscellaneous","i. Other Items","Row Total"]
["t. Any activity not described above that is authorized by the McKinney-Vento Homeless Assistance Act",null,null,null,null,null,null,null,null,null,{"$f":"SUM(B3:J3)","v":0}]
["u. Any activity not described above that is authorized by the Elementary and Secondary Education Act of 1965",null,null,null,null,null,null,null,null,null,{"$f":"SUM(B4:J4)","v":0}]
["v. Any activity not described above that is authorized by the Individuals with Disabilities Education Act",null,null,null,null,null,null,null,null,null,0]
["w. Any activity not described above that is authorized by the Adult Education and Family Literacy Act",null,null,null,null,null,null,null,null,null,0]
["w. Any activity not described above that is authorized by the Carl D. Perkins Career and Technical Education Act of 2006",null,null,null,null,null,null,null,null,null,0]
["y. Other activities not described above that are necessary to maintain the operation of and continuity of services in LEAs and continuing to employ existing staff of the LEA",null,null,null,null,null,null,null,null,null,0]
["Column Total",{"$f":"SUM(B3:B8)","v":0},{"$f":"SUM(C3:C8)","v":0},0,0,0,0,0,0,0,{"$f":"SUM(B3:J8)","v":0}]
[]
["If an expense doesn't fit one of the above descriptions, enter it into one of the other three tabs. The cells at the bottom of this sheet will track the total amount you've entered and will show the amount remaining to report"]
[]
[]
[null,null,"Reimbursed Amount (Exact amount to report)",null,null,{"$f":"'LEA Background'!$C$18","v":0}]
[]
[null,"Physical Health and Safety","Meeting Various Needs","Mental Health","Other","Total Reported"]
[null,{"$f":"'Physical Health And Safety'!B18","v":0},{"$f":"'Physical Health And Safety'!C18","v":0},{"$f":"'Physical Health And Safety'!D18","v":0},{"$f":"'Physical Health And Safety'!E18","v":0},{"$f":"Summary!B18","v":0},"Warnings"]
[null,null,null,null,null,null,{"$f":"IF(F$19<0,\"Double check that you haven't overreported in one of the templates\",\"NA\")","v":"NA"}]
[null,null,null,"Amount remaining to report",null,{"$f":"F14-F17","v":0}]
[]
[null,"a. Personnel Services - Salaries","b. Personnel Services - Benefits","c. Purchased Professional and Technical Services","d. Purchased Property Services","e. Other Purchased Services","f. Supplies","g. Property","h. Debt Service and Miscellaneous","i. Other Items"]
[null,{"$f":"'Physical Health And Safety'!B23","v":0},{"$f":"'Physical Health And Safety'!C23","v":0},{"$f":"'Physical Health And Safety'!D23","v":0},{"$f":"'Physical Health And Safety'!E23","v":0},{"$f":"'Physical Health And Safety'!F23","v":0},{"$f":"'Physical Health And Safety'!G23","v":0},{"$f":"'Physical Health And Safety'!H23","v":0},{"$f":"'Physical Health And Safety'!I23","v":0},{"$f":"'Physical Health And Safety'!J23","v":0}]

{"sheet":"Summary","index":6,"n_rows":36,"n_cols":12,"rows_kept":36,"cut":false,"hidden":false,"merged":[[26,4,26,7],[25,0,25,3],[28,0,29,3],[30,0,32,3],[23,0,24,3],[19,0,21,1],[2,1,2,3],[3,1,3,3],[11,3,11,4],[26,0,27,3],[0,0,0,4],[19,3,19,4],[20,3,20,4],[7,0,7,1],[7,3,7,4],[11,0,11,1],[1,1,1,2],[6,0,6,4],[12,0,12,1],[9,3,10,3],[23,4,25,7],[13,5,17,7]]}
["SUMMARY"]
["State ID",{"$f":"'LEA Background'!C1","v":0}]
["LEA Name",{"$f":"'LEA Background'!B3","v":"Please double check that you entered the correct ID number"}]
["NCES #",{"$f":"'LEA Background'!B7","v":"Please double check that you entered the correct ID number"}]
[]
[null,null,"Subrant"]
[{"$f":"'LEA Background'!B16","v":0}]
["Reimbursed Summary:",null,null,"Remaining Funds Summary:"]
["Awarded:",{"$f":"'LEA Background'!B18","v":0},null,"Remaining to Report for Planned Usage:",{"$f":"IF(L23<3,0,'LEA Background'!D18)","v":{"$error":"#N/A"}}]
[null,null,null,"If any amount is remaining, please report as a percentage where you plan to use the remaining funds"]
["Total Reimbursed:",{"$f":"'LEA Background'!C18","v":0}]
[{"$f":"IF(B11=0,\"No expended funds to report\",\"\")","v":"No expended funds to report"},null,null,{"$f":"IF(L23<3,\"No need to report on Planned Usage of CARES Funds\",IF(E9=0,\"No remaining funds to report\",\"\"))","v":{"$error":"#N/A"}}]
["Total Reported",null,null,"Category:","%"]
["Physical Health and Safety",{"$f":"'Physical Health And Safety'!K10","v":0},null,"Physical Health and Safety",null,{"$f":"IF(AND(E9=0,SUM(E14:E18)>0),\"Please leave these entries blank; there is no need to report planned usage of remaining funds for this subgrant\",\"\")","v":{"$error":"#N/A"}}]
["Meeting Various Needs",{"$f":"'Meeting Various Needs'!K14","v":0},null,"Meeting Various Needs"]
["Mental Health",{"$f":"'Mental Health'!K4","v":0},null,"Mental Health"]
["Other",{"$f":"Other!K9","v":0},null,"Other"]
["Total Reported",{"$f":"SUM(B14:B17)","v":0},null,"Not Yet planned"]
["Difference",{"$f":"B18-B11","v":0},null,"Total",{"$f":"IF(E9>0,SUM(E14:E18),\"\")","v":{"$error":"#N/A"}}]
[{"$f":"IF(B11=B18,\"Amount reported equals amount reimbursed in the reporting period. Thank you\",\"Please edit your entries until the amount reported equals the total amount expended. You will need to review the tabs and make edits until this is corrected\")","v":"Amount reported equals amount reimbursed in the reporting period. Thank you"},null,null,{"$f":"IF(OR(L23=1,L23=2,E9=0),\"No Data to Report; please leave responses to this section blank\",\"\")","v":{"$error":"#N/A"}}]
[null,null,null,{"$f":"IF(AND(K22=FALSE,E9>0),IF(E19<>100%,\"Please report 100% of planned usage of remaining funds\",\"100% of remaining funds has been reported. Thank you\"),\"\")","v":{"$error":"#N/A"}}]
[null,null,null,null,null,null,null,null,null,null,{"$f":"IF(L23<3,TRUE,FALSE)","v":{"$error":"#N/A"}}]
[null,null,null,null,null,null,null,null,null,null,"Reference",{"$f":"'LEA Background'!L22","v":{"$error":"#N/A"}}]
[{"$f":"IF(AND(L34=TRUE,L35=TRUE,L36=TRUE),\"No validation errors, you have entered all necessary information needed for this subgrant. Friendly reminder to work on any other sugbrant, if needed\",\"\")","v":{"$error":"#N/A"}},null,null,null,"If the reporting site is ready (anticipated date is December 4th, 2023), you may enter your data"]
[null,null,null,null,null,null,null,null,null,null,"CARES Set Aside (LMS and SEL)",1]
[{"$f":"IF(OR(L34=FALSE,L35=FALSE,L36=FALSE),\"Please review the Reimbursed and/or Remaining Funds Summaries for needed information\",\"\")","v":{"$error":"#N/A"}}]
["The remaining Tabs are for information only, no need to review",null,null,null,"https://idahoessercollection.mtwgms.org/melody/",null,null,null,null,null,"CARES Flow Through",2]
[null,null,null,null,null,null,null,null,null,null,"CRRSA Set Aside",3]
["We recommend you saving this template, macro enabled, and changing the name (i.e. \"CARES Set Aside Report\") if you plan to work on other subgrants. You can select the \"Erase Entries\" button below to start over. Clicking this will automatically delete all of your entries",null,null,null,null,null,null,null,null,null,"CRRSA Flow Through",4]
[null,null,null,null,null,null,null,null,null,null,"ARP Set Aside",5]
["WARNING: CLICKING THIS WILL ERASE YOUR WORK, TAKING YOU BACK TO THE LEA BACKGROUND TAB. ONLY SELECT IF YOU WANT TO BEGIN WORKING ON A DIFFERENT SUBGRANT. MAKE SURE TO SAVE THIS FILE BEFORE DELETING YOUR ENTRIES. YOU WILL NOT BE ABLE TO UNDO THIS ACTION",null,null,null,null,null,null,null,null,null,"ARP Flow Through",6]
[null,null,null,null,null,null,null,null,null,null,"ARP Learning Loss",7]
[]
[null,null,null,null,null,null,null,null,null,null,"expend check",{"$f":"IF(AND(B11=0,B19=0),TRUE,IF(B19=0,TRUE,FALSE))","v":true}]
[null,null,null,null,null,null,null,null,null,null,"remain check",{"$f":"IF(K22=TRUE,TRUE,IF(OR(E9=0,E19=100%),TRUE,FALSE))","v":{"$error":"#N/A"}}]
[null,null,null,null,null,null,null,null,null,null,"unnecessary check",{"$f":"IF(SUM(E14:E18)>0,IF(E9>0,TRUE,FALSE),TRUE)","v":true}]

{"sheet":"LEA Info","index":7,"n_rows":186,"n_cols":5,"rows_kept":186,"cut":false,"hidden":false,"merged":[]}
["ID","Name","DUNS","NCES","vendor"]
[58,"ABERDEEN DISTRICT",801867284,1600030,826000617]
[495,"ALTURAS INTERNATIONAL ACADEMY, INC.",71549639,1600175,473126055]
[560,"ALTURAS PREPARATORY ACADEMY, INC",36487482,1600199,853948402]
[381,"AMERICAN FALLS JOINT DISTRICT",144756442,1600060,826000865]
[482,"AMERICAN HERITAGE CHARTER SCHOOL, INC.",79082049,1600162,453753476]
[476,"ANOTHER CHOICE VIRTUAL CHARTER SCHOOL, INC.",966325438,1600155,263533892]
[492,"ANSER OF IDAHO, INC.",832063890,1600195,841390547]
[383,"ARBON ELEMENTARY DISTRICT",189339153,1600090,826003195]
[394,"AVERY SCHOOL DISTRICT",100599109,1600150,826001332]
[72,"BASIN SCHOOL DISTRICT",100014778,1600180,826000632]
[33,"BEAR LAKE COUNTY DISTRICT",183893577,1600240,826001400]
[477,"BLACKFOOT CHARTER COMMUNITY LEARNING CENTER, INC.",142291967,1600153,820524579]
[55,"BLACKFOOT DISTRICT",607630415,1600270,826000616]
[61,"BLAINE COUNTY DISTRICT",794328906,1600300,826001220]
[234,"BLISS JOINT DISTRICT",40197688,1600330,826000767]
[1,"Boise Independent District",122740046,1600360,826000549]
[93,"BONNEVILLE JOINT DISTRICT",879016822,1600930,826001206]
[101,"BOUNDARY COUNTY DISTRICT",10206712,1600420,826000683]
[365,"BRUNEAU-GRAND VIEW JOINT SCHOOL DISTRICT",29868007,1600450,826001219]
[412,"BUHL JOINT DISTRICT",100014851,1600480,826000893]
[111,"BUTTE COUNTY JOINT DISTRICT",29645454,1600490,826000685]
[132,"CALDWELL DISTRICT",100014869,1600510,826000728]
[121,"CAMAS COUNTY DISTRICT",100185412,1600540,826000686]
[432,"CAMBRIDGE JOINT DISTRICT",112893883,1600570,826000921]
[555,"CANYON-OWYHEE SCHOOL SERVICE AGENCY (COSSA)",29765393,1600152,820299347]
[566,"CARDINAL ACADEMY INCORPORATED",108110500,1600200,861222191]
[422,"CASCADE DISTRICT",100014885,1600630,826000907]
[151,"CASSIA COUNTY JOINT DISTRICT",879016707,1600660,826000732]
[417,"CASTLEFORD DISTRICT",181912668,1600690,826000891]
[181,"CHALLIS JOINT DISTRICT",193218112,1600720,826000736]
[483,"CHIEF TAHGEE ELEMENTARY ACADEMY, INC.",78351211,1600163,453150830]
[161,"CLARK COUNTY DISTRICT",24714961,1600750,826000733]
[491,"COEUR D'ALENE CHARTER ACADEMY, INC.",128705576,1600173,820509670]
[271,"COEUR D'ALENE DISTRICT",85188761,1600780,826000811]
[455,"COMPASS PUBLIC CHARTER SCHOOL, INC.",165024576,1600007,731729632]
[242,"COTTONWOOD JOINT DISTRICT",100014901,1600810,826003404]
[13,"COUNCIL DISTRICT",100185610,1600840,826004153]
[342,"CULDESAC JOINT DISTRICT",92284785,1600870,826001189]
[314,"DIETRICH DISTRICT",29816998,1600900,826003139]
[550,"DORAL ACADEMY OF IDAHO, INC.",117165868,1600197,842149691]
[523,"ELEVATE ACADEMY INC.",18395435,1600189,823036828]
[221,"EMMETT INDEPENDENT DISTRICT",7643034,1601020,826001228]
[456,"FALCON RIDGE PUBLIC CHARTER SCHOOL, INC.",182860341,1600008,270095874]
[531,"FERN-WATERS PUBLIC CHARTER SCHOOL, INC.",116915742,1600186,824261500]
[413,"FILER DISTRICT",100014943,1601050,826000894]
[59,"FIRTH DISTRICT",100014950,1601080,826000618]
[528,"FORGE INTERNATIONAL, LLC",116766344,1600190,352643363]
[215,"FREMONT COUNTY JOINT DISTRICT",184556975,1601110,826000751]
[373,"FRUITLAND DISTRICT",100014968,1601140,826000864]
[499,"FUTURE PUBLIC SCHOOL, INC.",80975896,1600181,822354868]
[71,"GARDEN VALLEY DISTRICT",29632296,1601170,826000631]
[549,"GEM PREP: MERIDIAN NORTH, LLC",117200585,1600196,842329869]
[498,"GEM PREP: MERIDIAN, LLC",81046990,1600179,371848621]
[796,"GEM PREP: NAMPA, LLC",81304980,1600205,473817130]
[534,"GEM PREP: ONLINE LLC",117035032,1600172,834122757]
[496,"GEM PREP: POCATELLO, LLC",80511840,1600177,473829757]
[282,"GENESEE JOINT DISTRICT",100185818,1601200,826000815]
[192,"GLENS FERRY JOINT DISTRICT",605581743,1601230,826002941]
[231,"GOODING JOINT DISTRICT",29720992,1601260,826000771]
[148,"GRACE JOINT DISTRICT",29651205,1601290,826000730]
[233,"HAGERMAN JOINT DISTRICT",193089125,1601380,826001373]
[415,"HANSEN DISTRICT",100015015,1601410,826001325]
[508,"HAYDEN CANYON CHARTER SCHOOL, INC.",80998762,1600184,462661679]
[479,"HERITAGE ACADEMY, INC.",69071435,1600159,273203580]
[481,"HERITAGE COMMUNITY CHARTER SCHOOL, INC.",58025766,1600161,273220966]
[305,"HIGHLAND JOINT DISTRICT",193083409,1601440,820255978]
[370,"HOMEDALE JOINT DISTRICT",100186048,1601470,826000860]
[73,"HORSESHOE BEND SCHOOL DISTRICT",949307193,1601500,826000626]
[795,"IDAHO ARTS CHARTER SCHOOL, INC.",191501993,1600204,201616506]
[596,"IDAHO BUREAU OF EDUCATIONAL SERVICES FOR THE DEAF AND THE BLIND",78569416,"NON-LEA",272336046]
[489,"IDAHO COLLEGE AND CAREER READINESS ACADEMY, INC.",79255786,1600171,462298596]
[91,"IDAHO FALLS DISTRICT",29642717,1601530,826001158]
[468,"IDAHO SCIENCE AND TECHNOLOGY CHARTER SCHOOL, INC.",826960853,1600145,262852741]
[485,"IDAHO STEM ACADEMY, INC.",78455129,1600169,274587929]
[452,"IDAHO VIRTUAL ACADEMY, INC.",793722781,1600004,10720150]
[469,"IDAHO VIRTUAL EDUCATION PARTNERS, INC.",832251305,1600148,263814847]
[453,"IDAHO VIRTUAL HIGH SCHOOL, INC.",170660455,1600005,10577656]
[457,"INSPIRE ACADEMICS, INC.",797530305,1600011,202193239]
[540,"ISLAND PARK CHARTER SCHOOL, INC.",117224934,1600192,831266928]
[466,"ISUCCEED VIRTUAL HIGH SCHOOL, INC.",878662498,1600144,262224774]
[251,"JEFFERSON COUNTY JOINT DISTRICT",29738903,1601570,826000779]
[261,"JEROME JOINT DISTRICT",100015056,1601590,826003634]
[2,"JOINT SCHOOL DISTRICT NO. 2",29604402,1602100,826001213]
[304,"KAMIAH JOINT DISTRICT",159151398,1601620,826004161]
[391,"KELLOGG JOINT DISTRICT",100186402,1601650,826000884]
[283,"KENDRICK JOINT DISTRICT",100646397,1601680,826000816]
[414,"KIMBERLY DISTRICT",879016921,1601710,826000895]
[274,"KOOTENAI DISTRICT",100646405,1601740,826003651]
[3,"KUNA JOINT DISTRICT",100015072,1601770,826001275]
[84,"LAKE PEND OREILLE SCHOOL DISTRICT",832156884,1600002,820508739]
[272,"LAKELAND DISTRICT",100015080,1601800,826000812]
[341,"LAPWAI DISTRICT",100015098,1601830,826000843]
[478,"LEGACY PUBLIC CHARTER SCHOOL, INC.",968870522,1600158,272515468]
[340,"LEWISTON INDEPENDENT DISTRICT",100186600,1601860,826000839]
[458,"LIBERTY CHARTER SCHOOL, INC.",105529221,1600012,820512446]
[182,"MACKAY JOINT DISTRICT",25531166,1601900,826000738]
[321,"MADISON DISTRICT",100646413,1601920,826000835]
[21,"MARSH VALLEY JOINT DISTRICT",193088374,1601950,826000590]
[363,"MARSING JOINT DISTRICT",86812005,1601980,826000855]
[421,"MCCALL-DONNELLY JOINT SCHOOL DISTRICT",100599125,1602030,826000906]
[11,"MEADOWS VALLEY DISTRICT",100015122,1602060,826000583]
[136,"MELBA JOINT DISTRICT",184973659,1602070,826001130]
[785,"MERIDIAN MEDICAL ARTS CHARTER HIGH SCHOOL, INC.",67651558,"NON-LEA",571149368]
[768,"MERIDIAN TECHNICAL CHARTER HIGH SCHOOL, INC.",44111453,"NON-LEA",820512811]
[134,"MIDDLETON DISTRICT",29646403,1602130,826003508]
[433,"MIDVALE DISTRICT",183894732,1602160,826001364]
[331,"MINIDOKA COUNTY JOINT DISTRICT",100015171,1602190,826000837]
[474,"MONTICELLO MONTESSORI CHARTER SCHOOL, INC.",961942005,1600154,270186469]
[544,"MOSAICS PUBLIC SCHOOL, INC.",117130660,1600191,832231987]
[813,"MOSCOW CHARTER SCHOOL, INC.",93632698,"NON-LEA",820505459]
[281,"MOSCOW DISTRICT",29785391,1602220,826000814]
[193,"MOUNTAIN HOME DISTRICT",127655744,1602250,826000742]
[244,"MOUNTAIN VIEW SCHOOL DISTRICT",76641414,1600139,593838651]
[392,"MULLAN DISTRICT",100015197,1602280,826000885]
[418,"MURTAUGH JOINT DISTRICT",192846512,1602310,826000890]
[131,"NAMPA SCHOOL DISTRICT",29646478,1602340,826000727]
[372,"NEW PLYMOUTH DISTRICT",29880812,1602370,826000863]
[302,"NEZPERCE JOINT DISTRICT",794728741,1602400,826001370]
[149,"NORTH GEM DISTRICT",800469277,1602430,826001137]
[480,"NORTH IDAHO STEM CHARTER ACADEMY, INC.",14744681,1600160,271042057]
[493,"NORTH STAR CHARTER SCHOOL, INC.",114313609,1600174,113643458]
[465,"NORTH VALLEY ACADEMY, INC.",830799883,1600143,260820021]
[135,"NOTUS DISTRICT",100015239,1602460,826002944]
[351,"ONEIDA COUNTY DISTRICT",100015247,1602490,826000844]
[171,"OROFINO JOINT DISTRICT",97241129,1602520,826000734]
[472,"PALOUSE PRAIRIE EDUCATIONAL ORGANIZATION, INC.",609526947,1600151,208870679]
[137,"PARMA DISTRICT",100015254,1602550,826003335]
[497,"PATHWAYS IN EDUCATION - NAMPA, INC.",80600403,1600183,814963154]
[371,"PAYETTE JOINT DISTRICT",181918483,1602580,826000862]
[794,"PAYETTE RIVER TECHNICAL ACADEMY, INC.",965786168,"NON-LEA",271285798]
[511,"PEACE VALLEY CHARTER SCHOOL, INC.",80965852,1600178,814365929]
[553,"PINECREST ACADEMY OF IDAHO, INC.",117180145,1600198,842768672]
[364,"PLEASANT VALLEY ELEMENTARY DISTRICT",179267117,1602610,826000847]
[44,"PLUMMER-WORLEY JOINT DISTRICT",621456672,1600815,826000613]
[25,"POCATELLO DISTRICT",29614922,1602640,826000591]
[273,"POST FALLS DISTRICT",76666767,1602670,826000813]
[285,"POTLATCH DISTRICT",100599133,1602700,826000817]
[191,"Prairie Elementary District",159147461,1602730,826001384]
[201,"PRESTON JOINT DISTRICT",157817024,1600960,826000749]
[513,"PROJECT IMPACT STEM ACADEMY, INC.",80846237,1600182,821955574]
[316,"RICHFIELD DISTRICT",29825924,1602760,826001279]
[252,"RIRIE JOINT DISTRICT",926460742,1602790,820259363]
[382,"ROCKLAND DISTRICT",100187848,1602820,826000866]
[454,"ROLLING HILLS PUBLIC CHARTER SCHOOL, INC.",938170441,1600006,201868297]
[751,"S E I TEC CHARTER SCHOOL, INC.",79245935,"NON-LEA",452633651]
[291,"SALMON DISTRICT",100015296,1602850,826000821]
[243,"SALMON RIVER JOINT SCHOOL DISTRICT",806404062,1600138,593838650]
[487,"SANDPOINT CHARTER SCHOOL, INC.",94295685,1600165,820505769]
[60,"SHELLEY JOINT DISTRICT",181965740,1602910,826000619]
[312,"SHOSHONE JOINT DISTRICT",193218260,1602940,826003374]
[52,"SNAKE RIVER DISTRICT",29628674,1602970,826000615]
[150,"SODA SPRINGS JOINT DISTRICT",878896901,1603000,826000731]
[292,"SOUTH LEMHI DISTRICT",100187988,1603030,826000822]
[41,"ST MARIES JOINT DISTRICT",10205979,1603060,826000612]
[322,"SUGAR-SALEM JOINT DISTRICT",58571670,1603090,826000836]
[92,"SWAN VALLEY ELEMENTARY DISTRICT",803155381,1603120,826000681]
[488,"SYRINGA MOUNTAIN SCHOOL, INC.",79390538,1600166,352450616]
[461,"TAYLOR'S CROSSING PUBLIC CHARTER SCHOOL, INC.",797535601,1600015,202701493]
[401,"TETON COUNTY DISTRICT",100599166,1603180,826000887]
[460,"THE ACADEMY, INC.",783840858,1600014,412193534]
[470,"The Kootenai Bridge Academy, Inc.",831646554,1600149,263573121]
[494,"THE POCATELLO COMMUNITY CHARTER SCHOOL, INC.",113912443,1600176,820506158]
[475,"THE SAGE INTERNATIONAL SCHOOL OF BOISE, A PUBLIC CHARTER SCHOOL, INC.",32655155,1600156,270169469]
[473,"THE VILLAGE CHARTER SCHOOL, INC.",968901947,1600157,270716284]
[559,"THOMAS JEFFERSON CHARTER SCHOOL, INC.",784840469,1600194,200508843]
[416,"THREE CREEK JOINT ELEMENTARY DISTRICT",193613791,1603210,826001249]
[532,"TREASURE VALLEY CLASSICAL ACADEMY, INC.",81137699,1600188,814720145]
[287,"TROY SCHOOL DISTRICT",824948165,1600009,820530483]
[411,"TWIN FALLS DISTRICT",100015353,1603240,826000892]
[486,"UPPER CARMEN PUBLIC CHARTER SCHOOL, INC.",186273954,1600170,760782276]
[262,"VALLEY DISTRICT",800469400,1603270,826001371]
[139,"VALLIVUE SCHOOL DISTRICT",155896269,1600600,826001904]
[451,"VICTORY CHARTER SCHOOL, INC.",195571505,1600003,562423033]
[463,"VISION CHARTER SCHOOL, INC.",7896716,1600141,680609551]
[393,"WALLACE DISTRICT",47780739,1603300,826000886]
[431,"WEISER DISTRICT",181914961,1603330,826000920]
[232,"WENDELL DISTRICT",100015379,1603360,826004158]
[83,"WEST BONNER COUNTY DISTRICT",98834174,1600001,820508740]
[253,"WEST JEFFERSON DISTRICT",122332075,1603400,820379941]
[202,"WEST SIDE JOINT DISTRICT",825388556,1603420,826000750]
[464,"WHITE PINE CHARTER SCHOOL, INC.",170300300,1600142,680502170]
[288,"WHITEPINE JOINT SCHOOL DISTRICT",37409539,1600010,820530482]
[133,"WILDER DISTRICT",29650553,1603480,826003336]
[462,"XAVIER CHARTER SCHOOL, INC.",3514777,1600140,205009576]
[4,"TEST LEA",101010,10101010,{"$error":"#N/A"}]

{"sheet":"Awarded","index":8,"n_rows":184,"n_cols":10,"rows_kept":184,"cut":false,"hidden":false,"merged":[]}
["ID","RecipientName","DUNS","CARES SA","CARES FT","CRRSA SA","CRRSA FT","ARP SA","ARP FT","ARP LL"]
[58,"ABERDEEN DISTRICT",801867284,16019.45,133884.35,0,503927.13,0,904805.38,226021.35]
[495,"ALTURAS INTERNATIONAL ACADEMY, INC.",71549639,14265.400000000001,52913.279999999999,30309.96,234551.48,0,421138.97,105201.33]
[560,"ALTURAS PREPARATORY ACADEMY, INC",36487482,0,0,0,96571.77,115011,173395.91,43314.78]
[381,"AMERICAN FALLS JOINT DISTRICT",144756442,27962.95,295973.63,0,1182846.05,0,2123808.8199999998,530530.30000000005]
[482,"AMERICAN HERITAGE CHARTER SCHOOL, INC.",79082049,12476.080000000002,24524.16,60969.05,132273.91,53776,237499.19,59327.62]
[492,"ANSER OF IDAHO, INC.",832063890,0,19499,54211.839999999997,145509.62,24223,261262.72,65263.78]
[383,"ARBON ELEMENTARY DISTRICT",189339153,8190.1900000000005,0,8579.48,0,349143,0,0]
[394,"AVERY SCHOOL DISTRICT",100599109,8289.93,0,11056.14,0,349143,0,0]
[72,"BASIN SCHOOL DISTRICT",100014778,11634,38320.31,0,213795.89,0,383871.79,95891.94]
[33,"BEAR LAKE COUNTY DISTRICT",183893577,23689,148980.82999999999,17582.63,595396.44999999995,0,1069038.68,267047.3]
[477,"BLACKFOOT CHARTER COMMUNITY LEARNING CENTER, INC.",142291967,14317.04,83477.64,0,428192.13,0,768822.82,192052.98]
[55,"BLACKFOOT DISTRICT",607630415,50921.19,470701.87,0,2297152.2599999998,0,4124554.04,1030319.4]
[61,"BLAINE COUNTY DISTRICT",794328906,46172.85,239900.1,339156.05,928892.02,0,1667832.49,416626.8]
[234,"BLISS JOINT DISTRICT",40197688,2307.9499999999998,28873.62,5462.73,105941.8,112575,190220.4,47517.31]
[1,"Boise Independent District",122740046,294674.17000000004,3814026.67,0,14756756.48,0,26495868.280000001,6618703.5700000003]
[93,"BONNEVILLE JOINT DISTRICT",879016822,159584.18,1257543.06,637538.11,5025717.88,0,9023715.6099999994,2254136.31]
[101,"BOUNDARY COUNTY DISTRICT",10206712,27242.35,340136.93,0,1591902.23,0,2858271.83,714000.15]
[365,"BRUNEAU-GRAND VIEW JOINT SCHOOL DISTRICT",29868007,11633.18,95210.67,0,380504.09,0,683197.61,170664.18]
[412,"BUHL JOINT DISTRICT",100014851,22433.18,256739.38,0,1101169.72,0,1977158.9,493896.95]
[111,"BUTTE COUNTY JOINT DISTRICT",29645454,15078,73248.14,0,287586.53000000003,0,516363.3,128988]
[132,"CALDWELL DISTRICT",100014869,76899.520000000004,1594660.9,0,6372999.0300000003,0,11442768.529999999,2858419.49]
[121,"CAMAS COUNTY DISTRICT",100185412,12806.92,17712.169999999998,26920.63,86464.08,156070,155246.88,38781.129999999997]
[432,"CAMBRIDGE JOINT DISTRICT",112893883,9401,38776.78,0,144960.38,25448,260278.58,65017.69]
[555,"CANYON-OWYHEE SCHOOL SERVICE AGENCY (COSSA)",29765393,9527.1299999999992,0,62107.33,0,0,0,0]
[566,"CARDINAL ACADEMY INCORPORATED",108110500,0,0,0,61920.99,141565,111178.82,27773.119999999999]
[422,"CASCADE DISTRICT",100014885,10315,138251.82999999999,0,626608.51,0,1125080.6100000001,281046.40000000002]
[151,"CASSIA COUNTY JOINT DISTRICT",879016707,72032.179999999993,733963.94,0,3092685.94,0,5552941.0899999999,1387132.41]
[417,"CASTLEFORD DISTRICT",181912668,14339.56,56111.56,0,211342.39,0,379466.68,94791.54]
[181,"CHALLIS JOINT DISTRICT",193218112,14207.130000000001,71388.23,0,475096.42,0,853039.4,213090.64]
[483,"CHIEF TAHGEE ELEMENTARY ACADEMY, INC.",78351211,11571,25107.759999999998,0,142957.89000000001,29921,256681.41,64119.360000000001]
[161,"CLARK COUNTY DISTRICT",24714961,9328.86,25220.87,2519.5300000000002,113406.56,95907,203622.93,50865.53]
[491,"COEUR D'ALENE CHARTER ACADEMY, INC.",128705576,0,0,233022.2,0,349143,0,0]
[271,"COEUR D'ALENE DISTRICT",85188761,132643.24,1708356.53,0,6027011.4199999999,0,10821544.720000001,2703236.94]
[455,"COMPASS PUBLIC CHARTER SCHOOL, INC.",165024576,20560.18,50263.56,208202.54,271142.62,0,486839.09,121613.31]
[242,"COTTONWOOD JOINT DISTRICT",100014901,14934,65726.429999999993,0,256590.95,0,460710.82,115085.93]
[13,"COUNCIL DISTRICT",100185610,11058.53,41975.06,0,211004.63,0,378859.98,94639.48]
[342,"CULDESAC JOINT DISTRICT",92284785,9134,25141.79,9186.91,100125.75,125563,179777.3,44908.36]
[314,"DIETRICH DISTRICT",29816998,10291.83,33717.589999999997,0,176958.21,0,317729.15000000002,79368.92]
[550,"DORAL ACADEMY OF IDAHO, INC.",117165868,2451.06,0,19447.78,43863.46,251198,78759.259999999995,19673.169999999998]
[523,"ELEVATE ACADEMY INC.",18395435,11146,66698.42,59774.62,353194.79,0,634163.79,158414.72]
[221,"EMMETT INDEPENDENT DISTRICT",7643034,35522,508268.41,0,2042702.11,0,3667687.68,916192.82]
[456,"FALCON RIDGE PUBLIC CHARTER SCHOOL, INC.",182860341,13833.45,24404.04,39094.639999999999,83678.83,162288,150247.09,37531.67]
[531,"FERN-WATERS PUBLIC CHARTER SCHOOL, INC.",116915742,8660.6899999999987,0,0,70299.8,192165,126223.25,31530.49]
[413,"FILER DISTRICT",100014943,29357.08,205175.48,23990.7,749793.01,0,1346258.89,336297.53]
[59,"FIRTH DISTRICT",100014950,17665.2,65504.2,86891.26,288679.98,0,518327.58,129479.18]
[528,"FORGE INTERNATIONAL, LLC",116766344,10862.06,21533.09,47554.68,125358.38,106811,225080.8,56225.49]
[215,"FREMONT COUNTY JOINT DISTRICT",184556975,34248.9,420348.22,0,1716747.47,0,3082432.56,769995.55]
[373,"FRUITLAND DISTRICT",100014968,26764.42,171639.08,85238.46,685949.7,0,1231627.06,307662.09999999998]
[499,"FUTURE PUBLIC SCHOOL, INC.",80975896,11360.78,50575.88,0,307841.99,0,552731.43999999994,138073.31]
[71,"GARDEN VALLEY DISTRICT",29632296,11149.21,81644.759999999995,0,296463.45,0,532302.77,132969.45000000001]
[549,"GEM PREP: MERIDIAN NORTH, LLC",117200585,0,0,0,66716.75,65381,119790.8,29923.9]
[498,"GEM PREP: MERIDIAN, LLC",81046990,12283.65,58410.92,0,254663.63,0,457249.81,114221.62]
[796,"GEM PREP: NAMPA, LLC",81304980,12937.509999999998,0,149104.76999999999,292348.21000000002,0,524913.21,131123.78]
[534,"GEM PREP: ONLINE LLC",117035032,11643.890000000001,99144.71,0,339968.1,0,610415.28,152482.56]
[496,"GEM PREP: POCATELLO, LLC",80511840,11598.55,55297.73,0,436314.36,0,783406.72,195696.3]
[282,"GENESEE JOINT DISTRICT",100185818,11609.64,36538.480000000003,32848.89,129026.62,61029,231667.43,57871.09]
[192,"GLENS FERRY JOINT DISTRICT",605581743,2918.7,96142.63,0,523162.31,0,939342.4,234648.5]
[231,"GOODING JOINT DISTRICT",29720992,11511.04,234046.1,0,921900.33,0,1655277.94,413490.66]
[148,"GRACE JOINT DISTRICT",29651205,16992.059999999998,52304.66,60597.45,209034.2,0,375321.88,93756.160000000003]
[233,"HAGERMAN JOINT DISTRICT",193089125,11367,61579.17,0,276673.03000000003,0,496769.6,124093.21]
[415,"HANSEN DISTRICT",100015015,11955.98,81002.100000000006,0,305356.40999999997,0,548270.27,136958.9]
[508,"HAYDEN CANYON CHARTER SCHOOL, INC.",80998762,11545.18,16069.49,24469.5,91541.48,144732,164363.44,41057.96]
[479,"HERITAGE ACADEMY, INC.",69071435,9438.48,45294.47,0,168856.02,0,303182.28999999998,75735.59]
[481,"HERITAGE COMMUNITY CHARTER SCHOOL, INC.",58025766,13432.2,101831.46,0,406964.49,0,730706.66,182531.51]
[305,"HIGHLAND JOINT DISTRICT",193083409,2588.84,28647.39,14693.54,104405.35,116008,187460.21,46828.06]
[370,"HOMEDALE JOINT DISTRICT",100186048,21792.41,242004.26,0,908868.07,0,1631880.83,407645.53]
[73,"HORSESHOE BEND SCHOOL DISTRICT",949307193,2718.18,41712.79,0,166705.19,0,299319.82,74770.240000000005]
[795,"IDAHO ARTS CHARTER SCHOOL, INC.",191501993,4595.74,0,404118.79,569979.39,0,1023401.8,255647.15]
[596,"IDAHO BUREAU OF EDUCATIONAL SERVICES FOR THE DEAF AND THE BLIND",78569416,9076.7799999999988,0,0,0,590000,0,0]
[489,"IDAHO COLLEGE AND CAREER READINESS ACADEMY, INC.",79255786,9737,0,118353.79,0,349143,0,0]
[91,"IDAHO FALLS DISTRICT",29642717,123603.08,1655222.02,0,6615025.29,0,11877328.039999999,2966973.04]
[468,"IDAHO SCIENCE AND TECHNOLOGY CHARTER SCHOOL, INC.",826960853,14541.18,43489.61,0,245996.17,0,441688.78,110334.2]
[485,"IDAHO STEM ACADEMY, INC.",78455129,9508.1,17464.919999999998,8218.09,69797.67,193287,125321.21,31305.41]
[452,"IDAHO VIRTUAL ACADEMY, INC.",793722781,27347,437174.48,15790.99,1704487.95,0,3060421.05,764497.55]
[469,"IDAHO VIRTUAL EDUCATION PARTNERS, INC.",832251305,10743.189999999999,0,157865.97,0,349143,0,0]
[453,"IDAHO VIRTUAL HIGH SCHOOL, INC.",170660455,13690.12,0,240392.95999999999,0,349143,0,0]
[457,"INSPIRE ACADEMICS, INC.",797530305,20680.87,151454.37,18913.86,859701.71,0,1543601.54,385593.49]
[540,"ISLAND PARK CHARTER SCHOOL, INC.",117224934,8189.18,0,6041.57,0,349143,0,0]
[466,"ISUCCEED VIRTUAL HIGH SCHOOL, INC.",878662498,0,0,0,491878.08,0,883171.31,220617.38]
[251,"JEFFERSON COUNTY JOINT DISTRICT",29738903,81273.73,544638.71999999997,544478.68999999994,2025086.57,0,3636058.03,908291.94]
[261,"JEROME JOINT DISTRICT",100015056,54623.74,649537.32999999996,0,2634062.5,0,4729478.96,1181430.46]
[2,"JOINT SCHOOL DISTRICT NO. 2",29604402,461978.11,3080352.01,2389437.21,13883392.1,0,24927736.309999999,6226981.8399999999]
[304,"KAMIAH JOINT DISTRICT",159151398,12601.01,257136.79,0,1235562.3799999999,0,2218461.4900000002,554174.92000000004]
[391,"KELLOGG JOINT DISTRICT",100186402,20249.940000000002,263958.78000000003,0,1054899.8600000001,0,1894080.64,473144.39]
[283,"KENDRICK JOINT DISTRICT",100646397,10809.68,29230.99,35743.08,101719.32,122006,182636.62,45622.62]
[414,"KIMBERLY DISTRICT",879016921,34045.71,140118.74,223946.57,583633.04,0,1047917.2,261771.38]
[274,"KOOTENAI DISTRICT",100646405,9575.2199999999993,43701.83,0,161283.01999999999,0,289584.53999999998,72338.36]
[3,"KUNA JOINT DISTRICT",100015072,71160.800000000003,853029.09,0,2925376.39,0,5252536.0199999996,1312090.07]
[84,"LAKE PEND OREILLE SCHOOL DISTRICT",832156884,39116.19,569861.6,0,2553329.2799999998,0,4584522,1145220.27]
[272,"LAKELAND DISTRICT",100015080,59617.909999999996,750789.2,0,2618696.0099999998,0,4701888.99,1174537.95]
[341,"LAPWAI DISTRICT",100015098,11991,149100.96,0,555908.81000000006,0,998137.52,249335.85]
[478,"LEGACY PUBLIC CHARTER SCHOOL, INC.",968870522,11231,36159.089999999997,12789.6,129394.44,60208,232328.19,58036.15]
[340,"LEWISTON INDEPENDENT DISTRICT",100186600,61618.18,633464.85,0,2531617.5499999998,0,4545538.83,1135481.72]
[458,"LIBERTY CHARTER SCHOOL, INC.",105529221,12198,42083.17,68382.69,144635.65,26174,259693.9,64871.64]
[182,"MACKAY JOINT DISTRICT",25531166,13041.69,24140.77,41917.370000000003,82788.83,164276,148648.24,37132.53]
[321,"MADISON DISTRICT",100646413,71227.179999999993,824270.59,0,3439153.63,0,6175025.8899999997,1542530.03]
[21,"MARSH VALLEY JOINT DISTRICT",193088374,22280.510000000002,165074.34,0,674402.79,0,1210895.04,302483.21000000002]
[363,"MARSING JOINT DISTRICT",86812005,17448.55,228321.23,0,870296.49,0,1562624.58,390345.23]
[421,"MCCALL-DONNELLY JOINT SCHOOL DISTRICT",100599125,25387,104996.71,185843.21,364795.83,0,654993.93000000005,163618.62]
[11,"MEADOWS VALLEY DISTRICT",100015122,2377.4899999999998,43197.31,0,193897.23,0,348144.39,86966.69]
[136,"MELBA JOINT DISTRICT",184973659,17854.099999999999,95592.06,43283.31,382031.52,0,685939.79,171348.43]
[785,"MERIDIAN MEDICAL ARTS CHARTER HIGH SCHOOL, INC.",67651558,10359.1,0,98899.88,0,0,0,0]
[768,"MERIDIAN TECHNICAL CHARTER HIGH SCHOOL, INC.",44111453,10258.58,0,103914.45,0,0,0,0]
[134,"MIDDLETON DISTRICT",29646403,53767.369999999995,295050.68,458773.69,1134277.03,0,2036602.77,508746.37]
[433,"MIDVALE DISTRICT",183894732,2289.81,27476.19,7617.81,109807.48,103944,197160.45,49250.94]
[331,"MINIDOKA COUNTY JOINT DISTRICT",100015171,58755,636068.52,0,2542021.9,0,4564219.4800000004,1140148.42]
[474,"MONTICELLO MONTESSORI CHARTER SCHOOL, INC.",961942005,5762.29,36724.67,0,162291.28,0,291394.63,72790.52]
[544,"MOSAICS PUBLIC SCHOOL, INC.",117130660,11310,18330.8,0,132369.12,93259,237670.38,59370.63]
[813,"MOSCOW CHARTER SCHOOL, INC.",93632698,2408,0,68148.91,0,0,0,0]
[281,"MOSCOW DISTRICT",29785391,34076.6,284049.39,0,1135193.0900000001,0,2038247.68,509157.52]
[193,"MOUNTAIN HOME DISTRICT",127655744,50416.18,634594,0,2953935.5,0,5303813.43,1324899.74]
[244,"MOUNTAIN VIEW SCHOOL DISTRICT",76641414,10192.040000000001,206283.62,0,845885.7,0,1518794.8,379397.24]
[392,"MULLAN DISTRICT",100015197,9139.84,43537.66,0,201289.82,0,361417.77,90282.9]
[418,"MURTAUGH JOINT DISTRICT",192846512,12191.18,33043.9,44684.98,154800.47,3526,277944.05,69431.3]
[131,"NAMPA SCHOOL DISTRICT",29646478,165115.23000000001,3419131.55,0,11974747.890000001,0,21500750.52,5370916.9299999997]
[372,"NEW PLYMOUTH DISTRICT",29880812,18268,158924.03,0,616089.89,0,1106193.73,276328.68]
[302,"NEZPERCE JOINT DISTRICT",794728741,9926.18,18084.55,36302.53,72277.240000000005,187750,129773.37,32417.81]
[149,"NORTH GEM DISTRICT",800469277,12493.82,16813.25,39465.22,59728.07,215771,107242.26,26789.759999999998]
[480,"NORTH IDAHO STEM CHARTER ACADEMY, INC.",14744681,15543,0,214656.55,0,349143,0,0]
[493,"NORTH STAR CHARTER SCHOOL, INC.",114313609,19249.489999999998,0,314522.19,0,349143,0,0]
[465,"NORTH VALLEY ACADEMY, INC.",830799883,10743.189999999999,39577.599999999999,0,158169.03,0,283994.06,70941.850000000006]
[135,"NOTUS DISTRICT",100015239,12811.35,74132.05,0,257441.86,0,462238.59,115468.07]
[351,"ONEIDA COUNTY DISTRICT",100015247,45103,111597.48,1875436.92,445992.09,0,800782.85,200036.88]
[171,"OROFINO JOINT DISTRICT",97241129,23275.19,170795.21,0,836082.7,0,1501192.4,374999.63]
[472,"PALOUSE PRAIRIE EDUCATIONAL ORGANIZATION, INC.",609526947,10049,15434.83,26183.55,60535.88,213967,108692.94,27151.89]
[137,"PARMA DISTRICT",100015254,19810.66,154946.95000000001,0,619238.96,0,1111849.28,277741.2]
[497,"PATHWAYS IN EDUCATION - NAMPA, INC.",80600403,11054.51,0,26541.88,125226.09,69514,224845.52,56166.46]
[371,"PAYETTE JOINT DISTRICT",181918483,23894.84,360135.45,0,1439265.62,0,2584213.2799999998,645540.21]
[794,"PAYETTE RIVER TECHNICAL ACADEMY, INC.",965786168,7765.2,0,76788.62,0,0,0,0]
[511,"PEACE VALLEY CHARTER SCHOOL, INC.",80965852,13949.18,14548.93,41796.910000000003,81235.34,167745,145860.01,36436.28]
[553,"PINECREST ACADEMY OF IDAHO, INC.",117180145,10225.33,0,41082.29,0,349143,0,0]
[364,"PLEASANT VALLEY ELEMENTARY DISTRICT",179267117,8082.48,0,6402.97,0,349143,0,0]
[44,"PLUMMER-WORLEY JOINT DISTRICT",621456672,12294.730000000001,234952.03,0,938977.66,0,1685940.47,421150.45]
[25,"POCATELLO DISTRICT",29614922,151276.85999999999,2135351.5699999998,0,8533847.3399999999,0,15322588,3827603.61]
[273,"POST FALLS DISTRICT",76666767,77495.95,951128.72,0,3626587.35,0,6511564.8300000001,1626597.66]
[285,"POTLATCH DISTRICT",100599133,13397.94,50778.09,11093.91,239490.57,0,430007.24,107416.14]
[191,"Prairie Elementary District",159147461,8054.17,0,6464.22,0,349143,0,0]
[201,"PRESTON JOINT DISTRICT",157817024,34493.94,193525.53,114368.27,850112.19,0,1526383.59,381292.93]
[513,"PROJECT IMPACT STEM ACADEMY, INC.",80846237,10382.5,33472.339999999997,0,161172.76999999999,72653,289387.31,72289.34]
[316,"RICHFIELD DISTRICT",29825924,10382.5,39615.64,0,180879.01,0,324770.31,81127.56]
[252,"RIRIE JOINT DISTRICT",926460742,16329.95,43245.36,139511.54999999999,169272.95999999999,0,303931.15999999997,75922.66]
[382,"ROCKLAND DISTRICT",100187848,10384.68,18439.919999999998,20329.82,90037.1,148091,161662.32,40383.71]
[454,"ROLLING HILLS PUBLIC CHARTER SCHOOL, INC.",938170441,10726.869999999999,24380.01,1008.63,132227.79999999999,53879,237417.09,59306.61]
[291,"SALMON DISTRICT",100015296,16677.439999999999,204267.55,0,816348.4,0,1465760.35,366148.41]
[243,"SALMON RIVER JOINT SCHOOL DISTRICT",806404062,9527.1299999999992,30432.22,1660.97,118267.47,85053,212350.05,53045.33]
[487,"SANDPOINT CHARTER SCHOOL, INC.",94295685,11564.289999999999,63571.22,0,254059.27,0,456164.55,113950.52]
[60,"SHELLEY JOINT DISTRICT",181965740,36743.19,212552.05,109002.52,849455.71,0,1525204.23,380997.82]
[312,"SHOSHONE JOINT DISTRICT",193218260,13522.869999999999,85063.26,0,342296.33,0,614596.12,153526.94]
[52,"SNAKE RIVER DISTRICT",29628674,28486.219999999998,306166.08,0,1049966.79,0,1885224.37,470931.59]
[150,"SODA SPRINGS JOINT DISTRICT",878896901,18687.3,79805.87,88872.79,318939.90000000002,0,572659.53,143051.12]
[292,"SOUTH LEMHI DISTRICT",100187988,9180.5499999999993,19764.28,34384.29,67777.13,197797,121695.01,30400.080000000002]
[41,"ST MARIES JOINT DISTRICT",10205979,4060.58,132766.20000000001,0,530594.99,0,952686.84,237982.71]
[322,"SUGAR-SALEM JOINT DISTRICT",58571670,25796,138760.35,41816.300000000003,708218.69,0,1270139,317535]
[92,"SWAN VALLEY ELEMENTARY DISTRICT",803155381,8694.94,0,27429.03,0,349143,0,0]
[488,"SYRINGA MOUNTAIN SCHOOL, INC.",79390538,9202.7199999999993,20236.759999999998,0,69888.87,193081,125486.39999999999,31346.42]
[461,"TAYLOR'S CROSSING PUBLIC CHARTER SCHOOL, INC.",797535601,14348,41276.339999999997,20771.86,159532.09,0,286441.89,71553.070000000007]
[401,"TETON COUNTY DISTRICT",100599166,29375.84,205648.97,7865.89,821865.79,0,1475665.83,368623.31]
[460,"THE ACADEMY, INC.",783840858,14072.97,55028.45,46848.23,188711.59,0,338833.6,84640.84]
[470,"The Kootenai Bridge Academy, Inc.",831646554,0,0,172909.67,0,349143,0,0]
[494,"THE POCATELLO COMMUNITY CHARTER SCHOOL, INC.",113912443,14384.380000000001,45432.61,0,228213.25,0,409757.78,102358.29]
[475,"THE SAGE INTERNATIONAL SCHOOL OF BOISE, A PUBLIC CHARTER SCHOOL, INC.",32655155,18935.689999999999,91611.98,35988.1,436186.08,0,783175.45,195638.28]
[473,"THE VILLAGE CHARTER SCHOOL, INC.",968901947,14419.19,30972.77,0,169266.94,0,303919.15000000002,75919.66]
[559,"THOMAS JEFFERSON CHARTER SCHOOL, INC.",784840469,12327.97,17379.830000000002,71734.240000000005,104027.5,116851,186782.42,46658]
[416,"THREE CREEK JOINT ELEMENTARY DISTRICT",193613791,8088.43,0,6402.97,0,349143,0,0]
[532,"TREASURE VALLEY CLASSICAL ACADEMY, INC.",81137699,11430.3,24026.65,67238.28,175433.78,133422,314992.98,78682.67]
[287,"TROY SCHOOL DISTRICT",824948165,2641.55,22104.68,43346.61,102372.79,120547,183809.98,45915.73]
[411,"TWIN FALLS DISTRICT",100015353,116278.57,1502821.68,0,7137839.8200000003,0,12816045.720000001,3201465.48]
[486,"UPPER CARMEN PUBLIC CHARTER SCHOOL, INC.",186273954,2140.65,0,20480.91,0,349143,0,0]
[262,"VALLEY DISTRICT",800469400,14941.029999999999,69420.22,0,318923.87,0,572629.5,143044.12]
[139,"VALLIVUE SCHOOL DISTRICT",155896269,117127,1014808.05,20098.080000000002,4055640.42,0,7281933.4400000004,1819036.78]
[451,"VICTORY CHARTER SCHOOL, INC.",195571505,12442.72,41490.559999999998,48000.800000000003,142294.39999999999,31402,255490.03,63822.25]
[463,"VISION CHARTER SCHOOL, INC.",7896716,18797.189999999999,59775.32,89758.92,242042.3,0,434588.55,108560.55]
[393,"WALLACE DISTRICT",47780739,13578.279999999999,113956.9,0,537609.74,0,965281.45,241128.86]
[431,"WEISER DISTRICT",181914961,5293.17,228582.49,0,1059038.1499999999,0,1901510.24,475000.07]
[232,"WENDELL DISTRICT",100015379,20724,154719.72,0,726153.95,0,1303814.71,325694.67]
[83,"WEST BONNER COUNTY DISTRICT",98834174,19733.09,377660.43,0,1371334.14,0,2462240.9500000002,615071.11]
[253,"WEST JEFFERSON DISTRICT",122332075,14799.960000000001,72103.97,31944.39,290735.59000000003,0,522018.85,130400.51]
[202,"WEST SIDE JOINT DISTRICT",825388556,16413.38,59000.53,73565.7,265799.62,0,477244.97,119216.44]
[464,"WHITE PINE CHARTER SCHOOL, INC.",170300300,17456.189999999999,37606.58,98153.62,164573.41,0,295493.38,73814.89]
[288,"WHITEPINE JOINT SCHOOL DISTRICT",37409539,10676.68,25686.35,21995.94,123604.45,73136,221932.15,55439.199999999997]
[133,"WILDER DISTRICT",29650553,13826.13,179445.09,0,651591.57999999996,0,1169936.58,292251.48]
[462,"XAVIER CHARTER SCHOOL, INC.",3514777,6664.1900000000005,53609,101739.97,190304.16,0,341692.91,85355.12]
[4,"TEST LEA",101010,10000,6000,7000,8000,null,10000,11000]

{"sheet":"Expended","index":9,"n_rows":184,"n_cols":21,"rows_kept":184,"cut":false,"hidden":false,"merged":[]}
["ID","NAME","Duns","Vendor","CARES Set Aside (LMS and SEL)","CARES Flow Through","CRRSA Set Aside","CRRSA Flow Through","ARP Set Aside","ARP Flow Through","ARP Learning Loss"]
[58,"ABERDEEN DISTRICT",801867284,826000617,8794.4500000000007,137.35,0,165547.34,0,425263.63999999996,116536.58,null,58,"ABERDEEN DISTRICT",8794.4500000000007,137.35,0,165547.34,0,425263.63999999996,116536.58]
[495,"ALTURAS INTERNATIONAL ACADEMY, INC.",71549639,473126055,11122.400000000001,54.28,30309.96,53349.9,0,378989.38,10251.9,null,495,"ALTURAS INTERNATIONAL ACADEMY, INC.",11122.400000000001,54.28,30309.96,53349.9,0,378989.38,10251.9]
[560,"ALTURAS PREPARATORY ACADEMY, INC",36487482,853948402,0,0,0,216.77,0,104017.26999999999,13823.36,null,560,"ALTURAS PREPARATORY ACADEMY, INC",0,0,0,216.77,0,104017.26999999999,13823.36]
[381,"AMERICAN FALLS JOINT DISTRICT",144756442,826000865,7315.83,303.63,0,100309.73999999999,0,1016601.29,108940.11,null,381,"AMERICAN FALLS JOINT DISTRICT",7315.83,303.63,0,100309.73999999999,0,1016601.29,108940.11]
[482,"AMERICAN HERITAGE CHARTER SCHOOL, INC.",79082049,453753476,441.08000000000004,52.04,60969.05,100844.2,53776,237499.19,29736.760000000002,null,482,"AMERICAN HERITAGE CHARTER SCHOOL, INC.",441.08000000000004,52.04,60969.05,100844.2,53776,237499.19,29736.760000000002]
[492,"ANSER OF IDAHO, INC.",832063890,841390547,0,0,43659.21,15468.32,6737.55,33025.94,0,null,492,"ANSER OF IDAHO, INC.",0,0,43659.21,15468.32,6737.55,33025.94,0]
[383,"ARBON ELEMENTARY DISTRICT",189339153,826003195,4032.19,0,332.34000000000003,0,94267.35,0,0,null,383,"ARBON ELEMENTARY DISTRICT",4032.19,0,332.34000000000003,0,94267.35,0,0]
[394,"AVERY SCHOOL DISTRICT",100599109,826001332,330.93,0,11056.14,0,272860.86,0,0,null,394,"AVERY SCHOOL DISTRICT",330.93,0,11056.14,0,272860.86,0,0]
[72,"BASIN SCHOOL DISTRICT",100014778,826000632,0,39.31,0,479.89,0,125435.09,34.94,null,72,"BASIN SCHOOL DISTRICT",0,39.31,0,479.89,0,125435.09,34.94]
[33,"BEAR LAKE COUNTY DISTRICT",183893577,826001400,2606,152.83000000000001,0,1336.45,0,383037.43,76910.69,null,33,"BEAR LAKE COUNTY DISTRICT",2606,152.83000000000001,0,1336.45,0,383037.43,76910.69]
[477,"BLACKFOOT CHARTER COMMUNITY LEARNING CENTER, INC.",142291967,820524579,8681.19,85.64,0,161974.37,0,437823.64,88925.97,null,477,"BLACKFOOT CHARTER COMMUNITY LEARNING CENTER, INC.",8681.19,85.64,0,161974.37,0,437823.64,88925.97]
[55,"BLACKFOOT DISTRICT",607630415,826000616,9942.33,0,0,30581.18,0,2452363.66,259417.58,null,55,"BLACKFOOT DISTRICT",9942.33,0,0,30581.18,0,2452363.66,259417.58]
[61,"BLAINE COUNTY DISTRICT",794328906,826001220,12881.17,246.1,236325.68,800449.05,0,561398.09,6807,null,61,"BLAINE COUNTY DISTRICT",12881.17,246.1,236325.68,800449.05,0,561398.09,6807]
[234,"BLISS JOINT DISTRICT",40197688,826000767,0,0,0,21740,0,82421.100000000006,18920.97,null,234,"BLISS JOINT DISTRICT",0,0,0,21740,0,82421.100000000006,18920.97]
[1,"Boise Independent District",122740046,826000549,0,0,0,8455995.6799999997,0,4960749.290000001,1291315.46,null,1,"Boise Independent District",0,0,0,8455995.6799999997,0,4960749.290000001,1291315.46]
[93,"BONNEVILLE JOINT DISTRICT",879016822,826001206,3053.18,1290.06,13040.11,11280.88,0,5408338.7200000007,1269989.4299999997,null,93,"BONNEVILLE JOINT DISTRICT",3053.18,1290.06,13040.11,11280.88,0,5408338.7200000007,1269989.4299999997]
[101,"BOUNDARY COUNTY DISTRICT",10206712,826000683,3799.35,68090.3,0,765602.36999999988,0,1689530.4300000002,239717.35000000003,null,101,"BOUNDARY COUNTY DISTRICT",3799.35,68090.3,0,765602.36999999988,0,1689530.4300000002,239717.35000000003]
[365,"BRUNEAU-GRAND VIEW JOINT SCHOOL DISTRICT",29868007,826001219,7225.18,97.67,0,52167.19,0,233748.83,18679.919999999998,null,365,"BRUNEAU-GRAND VIEW JOINT SCHOOL DISTRICT",7225.18,97.67,0,52167.19,0,233748.83,18679.919999999998]
[412,"BUHL JOINT DISTRICT",100014851,826000893,0,0,0,375802.36,0,423054.02999999997,310362.25000000006,null,412,"BUHL JOINT DISTRICT",0,0,0,375802.36,0,423054.02999999997,310362.25000000006]
[111,"BUTTE COUNTY JOINT DISTRICT",29645454,826000685,12260,49682.62,0,217838.39,0,177554.26,92949.959999999992,null,111,"BUTTE COUNTY JOINT DISTRICT",12260,49682.62,0,217838.39,0,177554.26,92949.959999999992]
[132,"CALDWELL DISTRICT",100014869,826000728,76899.520000000004,1635.9,0,3121573.07,0,356839.05000000005,1749390.46,null,132,"CALDWELL DISTRICT",76899.520000000004,1635.9,0,3121573.07,0,356839.05000000005,1749390.46]
[121,"CAMAS COUNTY DISTRICT",100185412,826000686,3146.92,18.170000000000002,550.63,194.08,112376.2,43883.35,14.13,null,121,"CAMAS COUNTY DISTRICT",3146.92,18.170000000000002,550.63,194.08,112376.2,43883.35,14.13]
[432,"CAMBRIDGE JOINT DISTRICT",112893883,826000921,261,39.78,0,22753.15,0,0,4723.88,null,432,"CAMBRIDGE JOINT DISTRICT",261,39.78,0,22753.15,0,0,4723.88]
[555,"CANYON-OWYHEE SCHOOL SERVICE AGENCY (COSSA)",29765393,820299347,331.07,0,1271.33,0,0,0,0,null,555,"CANYON-OWYHEE SCHOOL SERVICE AGENCY (COSSA)",331.07,0,1271.33,0,0,0,0]
[566,"CARDINAL ACADEMY INCORPORATED",108110500,861222191,0,0,0,1219.3,0,0,0,null,566,"CARDINAL ACADEMY INCORPORATED",0,0,0,1219.3,0,0,0]
[422,"CASCADE DISTRICT",100014885,826000907,2183,141.83000000000001,0,176231.37,0,373069.27,38267.67,null,422,"CASCADE DISTRICT",2183,141.83000000000001,0,176231.37,0,373069.27,38267.67]
[151,"CASSIA COUNTY JOINT DISTRICT",879016707,826000732,5089.18,752.94,0,476056.11000000004,0,2335522.7599999998,679428.5199999999,null,151,"CASSIA COUNTY JOINT DISTRICT",5089.18,752.94,0,476056.11000000004,0,2335522.7599999998,679428.5199999999]
[417,"CASTLEFORD DISTRICT",181912668,826000891,4011.46,57.56,0,474.39,0,229019.85,64884.119999999995,null,417,"CASTLEFORD DISTRICT",4011.46,57.56,0,474.39,0,229019.85,64884.119999999995]
[181,"CHALLIS JOINT DISTRICT",193218112,826000736,2952.13,73.23,0,22398.010000000002,0,241311.19,190030.2,null,181,"CHALLIS JOINT DISTRICT",2952.13,73.23,0,22398.010000000002,0,241311.19,190030.2]
[483,"CHIEF TAHGEE ELEMENTARY ACADEMY, INC.",78351211,453150830,2854,25.76,0,49982.55,7804.34,151781.95000000001,43850.26,null,483,"CHIEF TAHGEE ELEMENTARY ACADEMY, INC.",2854,25.76,0,49982.55,7804.34,151781.95000000001,43850.26]
[161,"CLARK COUNTY DISTRICT",24714961,826000733,5038.8599999999997,25.87,2519.13,49760.229999999996,78109.73,42960.959999999999,3954.2400000000002,null,161,"CLARK COUNTY DISTRICT",5038.8599999999997,25.87,2519.13,49760.229999999996,78109.73,42960.959999999999,3954.2400000000002]
[491,"COEUR D'ALENE CHARTER ACADEMY, INC.",128705576,820509670,0,0,102443.36,0,144562.51999999999,0,0,null,491,"COEUR D'ALENE CHARTER ACADEMY, INC.",0,0,102443.36,0,144562.51999999999,0,0]
[271,"COEUR D'ALENE DISTRICT",85188761,826000811,39656.06,35637.159999999996,0,1880666.59,0,2986513.1,305044.96999999997,null,271,"COEUR D'ALENE DISTRICT",39656.06,35637.159999999996,0,1880666.59,0,2986513.1,305044.96999999997]
[455,"COMPASS PUBLIC CHARTER SCHOOL, INC.",165024576,731729632,189.18,51.56,4258.54,608.62,0,191979.19,54102.58,null,455,"COMPASS PUBLIC CHARTER SCHOOL, INC.",189.18,51.56,4258.54,608.62,0,191979.19,54102.58]
[242,"COTTONWOOD JOINT DISTRICT",100014901,826003404,2953,67.430000000000007,0,575.95000000000005,0,111367.02,43571.040000000001,null,242,"COTTONWOOD JOINT DISTRICT",2953,67.430000000000007,0,575.95000000000005,0,111367.02,43571.040000000001]
[13,"COUNCIL DISTRICT",100185610,826004153,0,0,0,26612.129999999997,0,214728.72999999998,43177,null,13,"COUNCIL DISTRICT",0,0,0,26612.129999999997,0,214728.72999999998,43177]
[342,"CULDESAC JOINT DISTRICT",92284785,826001189,0,25.79,187.91,22527.26,32050,0,37140.800000000003,null,342,"CULDESAC JOINT DISTRICT",0,25.79,187.91,22527.26,32050,0,37140.800000000003]
[314,"DIETRICH DISTRICT",29816998,826003139,122.83,34.590000000000003,0,89480.24,0,116218.96999999999,33990.590000000004,null,314,"DIETRICH DISTRICT",122.83,34.590000000000003,0,89480.24,0,116218.96999999999,33990.590000000004]
[550,"DORAL ACADEMY OF IDAHO, INC.",117165868,842149691,0,0,19447.78,0,146046.69,29749.05,0,null,550,"DORAL ACADEMY OF IDAHO, INC.",0,0,19447.78,0,146046.69,29749.05,0]
[523,"ELEVATE ACADEMY INC.",18395435,823036828,0,0,59774.619999999995,205446.71000000002,0,133638.41999999998,0,null,523,"ELEVATE ACADEMY INC.",0,0,59774.619999999995,205446.71000000002,0,133638.41999999998,0]
[221,"EMMETT INDEPENDENT DISTRICT",7643034,826001228,16007.880000000001,521.41,0,269697.14999999997,0,1283364.8400000003,294273.68,null,221,"EMMETT INDEPENDENT DISTRICT",16007.880000000001,521.41,0,269697.14999999997,0,1283364.8400000003,294273.68]
[456,"FALCON RIDGE PUBLIC CHARTER SCHOOL, INC.",182860341,270095874,11248.45,25.04,799.64,83678.83,12310.92,74657.909999999989,27527.900000000009,null,456,"FALCON RIDGE PUBLIC CHARTER SCHOOL, INC.",11248.45,25.04,799.64,83678.83,12310.92,74657.909999999989,27527.900000000009]
[531,"FERN-WATERS PUBLIC CHARTER SCHOOL, INC.",116915742,824261500,394.09,0,0,2490.7799999999997,89947.189999999988,0,5294.9800000000005,null,531,"FERN-WATERS PUBLIC CHARTER SCHOOL, INC.",394.09,0,0,2490.7799999999997,89947.189999999988,0,5294.9800000000005]
[413,"FILER DISTRICT",100014943,826000894,29357.08,1743.13,0,62928.26,0,0,10820.25,null,413,"FILER DISTRICT",29357.08,1743.13,0,62928.26,0,0,10820.25]
[59,"FIRTH DISTRICT",100014950,826000618,751.2,67.2,1777.26,22173.5,0,231000,44330.450000000004,null,59,"FIRTH DISTRICT",751.2,67.2,1777.26,22173.5,0,231000,44330.450000000004]
[528,"FORGE INTERNATIONAL, LLC",116766344,352643363,323.06,22.09,17513.18,19445.13,106811,33232.850000000006,20.49,null,528,"FORGE INTERNATIONAL, LLC",323.06,22.09,17513.18,19445.13,106811,33232.850000000006,20.49]
[215,"FREMONT COUNTY JOINT DISTRICT",184556975,826000751,4520,431.22,0,3853.47,0,2576008.2499999995,402378.96,null,215,"FREMONT COUNTY JOINT DISTRICT",4520,431.22,0,3853.47,0,2576008.2499999995,402378.96]
[373,"FRUITLAND DISTRICT",100014968,826000864,6367.42,176.08,0,481141.24,0,130140.04,41824.769999999997,null,373,"FRUITLAND DISTRICT",6367.42,176.08,0,481141.24,0,130140.04,41824.769999999997]
[499,"FUTURE PUBLIC SCHOOL, INC.",80975896,822354868,6559.78,4745.32,0,179141.31,0,170254.19,104248.23,null,499,"FUTURE PUBLIC SCHOOL, INC.",6559.78,4745.32,0,179141.31,0,170254.19,104248.23]
[71,"GARDEN VALLEY DISTRICT",29632296,826000631,0,0,0,74635.12,0,210886.75,74541.77,null,71,"GARDEN VALLEY DISTRICT",0,0,0,74635.12,0,210886.75,74541.77]
[549,"GEM PREP: MERIDIAN NORTH, LLC",117200585,842329869,0,0,0,149.75,0,10690.84,3957.51,null,549,"GEM PREP: MERIDIAN NORTH, LLC",0,0,0,149.75,0,10690.84,3957.51]
[498,"GEM PREP: MERIDIAN, LLC",81046990,371848621,387.64,0,0,27954.54,0,19834.3,47871.46,null,498,"GEM PREP: MERIDIAN, LLC",387.64,0,0,27954.54,0,19834.3,47871.46]
[796,"GEM PREP: NAMPA, LLC",81304980,473817130,461.82,0,3049.77,233917.22999999998,0,1853.63,71084.17,null,796,"GEM PREP: NAMPA, LLC",461.82,0,3049.77,233917.22999999998,0,1853.63,71084.17]
[534,"GEM PREP: ONLINE LLC",117035032,834122757,365.79,101.71,0,110782.38,0,14.94,52102.28,null,534,"GEM PREP: ONLINE LLC",365.79,101.71,0,110782.38,0,14.94,52102.28]
[496,"GEM PREP: POCATELLO, LLC",80511840,473829757,408.51,56.73,0,190172.93000000002,0,3435.56,67603.670000000013,null,496,"GEM PREP: POCATELLO, LLC",408.51,56.73,0,190172.93000000002,0,3435.56,67603.670000000013]
[282,"GENESEE JOINT DISTRICT",100185818,826000815,0,0,32848.89,3653.81,60278.65,0,0,null,282,"GENESEE JOINT DISTRICT",0,0,32848.89,3653.81,60278.65,0,0]
[192,"GLENS FERRY JOINT DISTRICT",605581743,826002941,0,0,0,102775.85,0,183243.49,92690.58,null,192,"GLENS FERRY JOINT DISTRICT",0,0,0,102775.85,0,183243.49,92690.58]
[231,"GOODING JOINT DISTRICT",29720992,826000771,0,0,0,51210.64,0,462640.82,159100.69,null,231,"GOODING JOINT DISTRICT",0,0,0,51210.64,0,462640.82,159100.69]
[148,"GRACE JOINT DISTRICT",29651205,826000730,16992.059999999998,53.66,0,0,0,25129.21,11338.21,null,148,"GRACE JOINT DISTRICT",16992.059999999998,53.66,0,0,0,25129.21,11338.21]
[233,"HAGERMAN JOINT DISTRICT",193089125,826001373,318,63.17,0,52801.57,0,45043.320000000007,26713.23,null,233,"HAGERMAN JOINT DISTRICT",318,63.17,0,52801.57,0,45043.320000000007,26713.23]
[415,"HANSEN DISTRICT",100015015,826001325,9265.9800000000014,83.1,0,170795.45,0,86026.359999999971,56159.37,null,415,"HANSEN DISTRICT",9265.9800000000014,83.1,0,170795.45,0,86026.359999999971,56159.37]
[508,"HAYDEN CANYON CHARTER SCHOOL, INC.",80998762,462661679,189.18,16.489999999999998,0,205.48,0,0,0,null,508,"HAYDEN CANYON CHARTER SCHOOL, INC.",189.18,16.489999999999998,0,205.48,0,0,0]
[479,"HERITAGE ACADEMY, INC.",69071435,273203580,330.48,46.47,0,927.31,0,89161.249999999985,32909.64,null,479,"HERITAGE ACADEMY, INC.",330.48,46.47,0,927.31,0,89161.249999999985,32909.64]
[481,"HERITAGE COMMUNITY CHARTER SCHOOL, INC.",58025766,273220966,10485.200000000001,104.46,0,16863.89,0,190147.41,182531.50999999998,null,481,"HERITAGE COMMUNITY CHARTER SCHOOL, INC.",10485.200000000001,104.46,0,16863.89,0,190147.41,182531.50999999998]
[305,"HIGHLAND JOINT DISTRICT",193083409,820255978,1824.1,29.39,14693.54,48553.630000000005,0,112905.75,9733.06,null,305,"HIGHLAND JOINT DISTRICT",1824.1,29.39,14693.54,48553.630000000005,0,112905.75,9733.06]
[370,"HOMEDALE JOINT DISTRICT",100186048,826000860,781.41,248.26,0,73980.01999999999,0,55244.85,268770,null,370,"HOMEDALE JOINT DISTRICT",781.41,248.26,0,73980.01999999999,0,55244.85,268770]
[73,"HORSESHOE BEND SCHOOL DISTRICT",949307193,826000626,189.18,42.79,0,374.19,0,193281.05,48471.09,null,73,"HORSESHOE BEND SCHOOL DISTRICT",189.18,42.79,0,374.19,0,193281.05,48471.09]
[795,"IDAHO ARTS CHARTER SCHOOL, INC.",191501993,201616506,40,0,0,3448.35,0,791487.31,255647.14999999997,null,795,"IDAHO ARTS CHARTER SCHOOL, INC.",40,0,0,3448.35,0,791487.31,255647.14999999997]
[596,"IDAHO BUREAU OF EDUCATIONAL SERVICES FOR THE DEAF AND THE BLIND",78569416,272336046,2681.28,0,0,0,11872,0,0,null,596,"IDAHO BUREAU OF EDUCATIONAL SERVICES FOR THE DEAF AND THE BLIND",2681.28,0,0,0,11872,0,0]
[489,"IDAHO COLLEGE AND CAREER READINESS ACADEMY, INC.",79255786,462298596,0,0,2420.79,0,166692.6,0,0,null,489,"IDAHO COLLEGE AND CAREER READINESS ACADEMY, INC.",0,0,2420.79,0,166692.6,0,0]
[91,"IDAHO FALLS DISTRICT",29642717,826001158,4495.08,1698.02,0,3803432.4399999995,0,4790160.24,2011064.65,null,91,"IDAHO FALLS DISTRICT",4495.08,1698.02,0,3803432.4399999995,0,4790160.24,2011064.65]
[468,"IDAHO SCIENCE AND TECHNOLOGY CHARTER SCHOOL, INC.",826960853,262852741,2795.18,44.61,0,552.16999999999996,0,300511.78000000003,40.200000000000003,null,468,"IDAHO SCIENCE AND TECHNOLOGY CHARTER SCHOOL, INC.",2795.18,44.61,0,552.16999999999996,0,300511.78000000003,40.200000000000003]
[485,"IDAHO STEM ACADEMY, INC.",78455129,274587929,9508.1,17.920000000000002,0,26579.07,167013.77000000002,0,14472.67,null,485,"IDAHO STEM ACADEMY, INC.",9508.1,17.920000000000002,0,26579.07,167013.77000000002,0,14472.67]
[452,"IDAHO VIRTUAL ACADEMY, INC.",793722781,10720150,786,448.48,322.99,311428.21000000002,0,2411365.2400000002,366974.89999999997,null,452,"IDAHO VIRTUAL ACADEMY, INC.",786,448.48,322.99,311428.21000000002,0,2411365.2400000002,366974.89999999997]
[469,"IDAHO VIRTUAL EDUCATION PARTNERS, INC.",832251305,263814847,10733.330000000002,0,128558.59,0,135692.84,0,0,null,469,"IDAHO VIRTUAL EDUCATION PARTNERS, INC.",10733.330000000002,0,128558.59,0,135692.84,0,0]
[453,"IDAHO VIRTUAL HIGH SCHOOL, INC.",170660455,10577656,0,0,4916.96,0,59173.04,0,0,null,453,"IDAHO VIRTUAL HIGH SCHOOL, INC.",0,0,4916.96,0,59173.04,0,0]
[457,"INSPIRE ACADEMICS, INC.",797530305,202193239,16038.87,0,0,98689.88,0,642963.30000000005,0,null,457,"INSPIRE ACADEMICS, INC.",16038.87,0,0,98689.88,0,642963.30000000005,0]
[540,"ISLAND PARK CHARTER SCHOOL, INC.",117224934,831266928,285.18,0,2353.4299999999998,0,0,0,0,null,540,"ISLAND PARK CHARTER SCHOOL, INC.",285.18,0,2353.4299999999998,0,0,0,0]
[466,"ISUCCEED VIRTUAL HIGH SCHOOL, INC.",878662498,262224774,0,0,0,375839.86,0,0,0,null,466,"ISUCCEED VIRTUAL HIGH SCHOOL, INC.",0,0,0,375839.86,0,0,0]
[251,"JEFFERSON COUNTY JOINT DISTRICT",29738903,826000779,17197.41,558.72,0,0,0,1939356.13,131192.96000000002,null,251,"JEFFERSON COUNTY JOINT DISTRICT",17197.41,558.72,0,0,0,1939356.13,131192.96000000002]
[261,"JEROME JOINT DISTRICT",100015056,826003634,1978.7399999999998,666.33,0,557169.34,0,141832.62,276653.31999999995,null,261,"JEROME JOINT DISTRICT",1978.7399999999998,666.33,0,557169.34,0,141832.62,276653.31999999995]
[2,"JOINT SCHOOL DISTRICT NO. 2",29604402,826001213,27551.020000000004,21581.65,1186958.3599999999,10366378.520000001,0,11913174.43,682396,null,2,"JOINT SCHOOL DISTRICT NO. 2",27551.020000000004,21581.65,1186958.3599999999,10366378.520000001,0,11913174.43,682396]
[304,"KAMIAH JOINT DISTRICT",159151398,826004161,2978.8599999999997,2860.91,0,435856.75000000006,0,90354.260000000009,135591.29,null,304,"KAMIAH JOINT DISTRICT",2978.8599999999997,2860.91,0,435856.75000000006,0,90354.260000000009,135591.29]
[391,"KELLOGG JOINT DISTRICT",100186402,826000884,20249.940000000002,270.77999999999997,0,2367.86,0,1069824,132683.32999999999,null,391,"KELLOGG JOINT DISTRICT",20249.940000000002,270.77999999999997,0,2367.86,0,1069824,132683.32999999999]
[283,"KENDRICK JOINT DISTRICT",100646397,826000816,6189.6299999999992,578.30999999999995,20365,51395.26,22862.690000000002,0,2512.58,null,283,"KENDRICK JOINT DISTRICT",6189.6299999999992,578.30999999999995,20365,51395.26,22862.690000000002,0,2512.58]
[414,"KIMBERLY DISTRICT",879016921,826000895,3560.71,143.74,4418.3500000000004,179588.52000000002,0,98120,50198.82,null,414,"KIMBERLY DISTRICT",3560.71,143.74,4418.3500000000004,179588.52000000002,0,98120,50198.82]
[274,"KOOTENAI DISTRICT",100646405,826003651,0,44.83,0,36445.78,0,107070.95,38738.990000000005,null,274,"KOOTENAI DISTRICT",0,44.83,0,36445.78,0,107070.95,38738.990000000005]
[3,"KUNA JOINT DISTRICT",100015072,826001275,2581.8000000000002,875.09,0,1260484.03,0,1003747.75,999680.15999999992,null,3,"KUNA JOINT DISTRICT",2581.8000000000002,875.09,0,1260484.03,0,1003747.75,999680.15999999992]
[84,"LAKE PEND OREILLE SCHOOL DISTRICT",832156884,820508739,24936.190000000002,584.6,0,0,0,2700377.97,446781.61999999994,null,84,"LAKE PEND OREILLE SCHOOL DISTRICT",24936.190000000002,584.6,0,0,0,2700377.97,446781.61999999994]
[272,"LAKELAND DISTRICT",100015080,826000812,2160.9100000000003,770.2,0,597855.64,0,2022571.65,1042717.32,null,272,"LAKELAND DISTRICT",2160.9100000000003,770.2,0,597855.64,0,2022571.65,1042717.32]
[341,"LAPWAI DISTRICT",100015098,826000843,0,152.96,0,1247.81,0,696561.72000000009,106293.60999999999,null,341,"LAPWAI DISTRICT",0,152.96,0,1247.81,0,696561.72000000009,106293.60999999999]
[478,"LEGACY PUBLIC CHARTER SCHOOL, INC.",968870522,272515468,0,37.090000000000003,6789.5999999999995,1477.61,20042.86,64567.47,28774,null,478,"LEGACY PUBLIC CHARTER SCHOOL, INC.",0,37.090000000000003,6789.5999999999995,1477.61,20042.86,64567.47,28774]
[340,"LEWISTON INDEPENDENT DISTRICT",100186600,826000839,27593.83,649.85,0,251149.06,0,1022859.74,751827.95,null,340,"LEWISTON INDEPENDENT DISTRICT",27593.83,649.85,0,251149.06,0,1022859.74,751827.95]
[458,"LIBERTY CHARTER SCHOOL, INC.",105529221,820512446,0,43.17,68382.69,324.64999999999998,26174,23280.97,21156.04,null,458,"LIBERTY CHARTER SCHOOL, INC.",0,43.17,68382.69,324.64999999999998,26174,23280.97,21156.04]
[182,"MACKAY JOINT DISTRICT",25531166,826000738,13000.16,13119.599999999999,0,82603,100000,148000,10101.370000000001,null,182,"MACKAY JOINT DISTRICT",13000.16,13119.599999999999,0,82603,100000,148000,10101.370000000001]
[321,"MADISON DISTRICT",100646413,826000835,4783.18,845.59,0,7719.63,0,3328648.31,1048080.9199999999,null,321,"MADISON DISTRICT",4783.18,845.59,0,7719.63,0,3328648.31,1048080.9199999999]
[21,"MARSH VALLEY JOINT DISTRICT",193088374,826000590,0,120,0,1513.79,0,1037929.44,0,null,21,"MARSH VALLEY JOINT DISTRICT",0,120,0,1513.79,0,1037929.44,0]
[363,"MARSING JOINT DISTRICT",86812005,826000855,62.55,234.23,0,70686.34,0,583780.46,47775.09,null,363,"MARSING JOINT DISTRICT",62.55,234.23,0,70686.34,0,583780.46,47775.09]
[421,"MCCALL-DONNELLY JOINT SCHOOL DISTRICT",100599125,826000906,2606,107.71,64974.39,112547.62,0,198057.59999999998,29432.97,null,421,"MCCALL-DONNELLY JOINT SCHOOL DISTRICT",2606,107.71,64974.39,112547.62,0,198057.59999999998,29432.97]
[11,"MEADOWS VALLEY DISTRICT",100015122,826000583,39.49,44.6,0,102901.85,0,0,18375.14,null,11,"MEADOWS VALLEY DISTRICT",39.49,44.6,0,102901.85,0,0,18375.14]
[136,"MELBA JOINT DISTRICT",184973659,826001130,638.1,98.06,885.31,137076.52000000002,0,143222.37999999998,41454.670000000013,null,136,"MELBA JOINT DISTRICT",638.1,98.06,885.31,137076.52000000002,0,143222.37999999998,41454.670000000013]
[785,"MERIDIAN MEDICAL ARTS CHARTER HIGH SCHOOL, INC.",67651558,571149368,3332.3899999999994,0,23854.87,0,0,0,0,null,785,"MERIDIAN MEDICAL ARTS CHARTER HIGH SCHOOL, INC.",3332.3899999999994,0,23854.87,0,0,0,0]
[768,"MERIDIAN TECHNICAL CHARTER HIGH SCHOOL, INC.",44111453,820512811,0,0,65450.310000000005,0,0,0,0,null,768,"MERIDIAN TECHNICAL CHARTER HIGH SCHOOL, INC.",0,0,65450.310000000005,0,0,0,0]
[134,"MIDDLETON DISTRICT",29646403,826003508,1947.3700000000001,302.68,9383.69,235859.8,0,2207.5500000000002,0,null,134,"MIDDLETON DISTRICT",1947.3700000000001,302.68,9383.69,235859.8,0,2207.5500000000002,0]
[433,"MIDVALE DISTRICT",183894732,826001364,0,0,155.81,1769.63,0,13855,18758.82,null,433,"MIDVALE DISTRICT",0,0,155.81,1769.63,0,13855,18758.82]
[331,"MINIDOKA COUNTY JOINT DISTRICT",100015171,826000837,2606,652.52,0,376928.55,0,2173499.4300000002,280671.55,null,331,"MINIDOKA COUNTY JOINT DISTRICT",2606,652.52,0,376928.55,0,2173499.4300000002,280671.55]
[474,"MONTICELLO MONTESSORI CHARTER SCHOOL, INC.",961942005,270186469,3196.29,37.67,0,32622.280000000002,0,136276.94,14932.259999999998,null,474,"MONTICELLO MONTESSORI CHARTER SCHOOL, INC.",3196.29,37.67,0,32622.280000000002,0,136276.94,14932.259999999998]
[544,"MOSAICS PUBLIC SCHOOL, INC.",117130660,832231987,23,18.8,0,40639.300000000003,0,126291.75,26294.65,null,544,"MOSAICS PUBLIC SCHOOL, INC.",23,18.8,0,40639.300000000003,0,126291.75,26294.65]
[813,"MOSCOW CHARTER SCHOOL, INC.",93632698,820505459,0,0,25565.149999999998,0,0,0,0,null,813,"MOSCOW CHARTER SCHOOL, INC.",0,0,25565.149999999998,0,0,0,0]
[281,"MOSCOW DISTRICT",29785391,826000814,8811.6,291.39,0,130011.84,0,307428.57999999996,177935.94,null,281,"MOSCOW DISTRICT",8811.6,291.39,0,130011.84,0,307428.57999999996,177935.94]
[193,"MOUNTAIN HOME DISTRICT",127655744,826000742,189.18,651,0,987226.88,0,3364581.4,387233.95999999996,null,193,"MOUNTAIN HOME DISTRICT",189.18,651,0,987226.88,0,3364581.4,387233.95999999996]
[244,"MOUNTAIN VIEW SCHOOL DISTRICT",76641414,593838651,2835.18,211.62,0,405436.41000000003,0,198806.55000000002,310797.87,null,244,"MOUNTAIN VIEW SCHOOL DISTRICT",2835.18,211.62,0,405436.41000000003,0,198806.55000000002,310797.87]
[392,"MULLAN DISTRICT",100015197,826000885,1222.6299999999999,44.66,0,101070.58000000002,0,0,0,null,392,"MULLAN DISTRICT",1222.6299999999999,44.66,0,101070.58000000002,0,0,0]
[418,"MURTAUGH JOINT DISTRICT",192846512,826000890,526.18000000000006,33.9,913.98,347.47,3526,140548.85,40185.629999999997,null,418,"MURTAUGH JOINT DISTRICT",526.18000000000006,33.9,913.98,347.47,3526,140548.85,40185.629999999997]
[131,"NAMPA SCHOOL DISTRICT",29646478,826000727,1342.56,7397.5300000000007,0,4067279.6199999996,0,6985000.2100000009,1358981.7100000002,null,131,"NAMPA SCHOOL DISTRICT",1342.56,7397.5300000000007,0,4067279.6199999996,0,6985000.2100000009,1358981.7100000002]
[372,"NEW PLYMOUTH DISTRICT",29880812,826000863,0,0,0,196936.90000000002,0,560534.48,224720.29,null,372,"NEW PLYMOUTH DISTRICT",0,0,0,196936.90000000002,0,560534.48,224720.29]
[302,"NEZPERCE JOINT DISTRICT",794728741,826001370,460.18,18.55,36302.53,72277.240000000005,17915.05,99056.05,11.81,null,302,"NEZPERCE JOINT DISTRICT",460.18,18.55,36302.53,72277.240000000005,17915.05,99056.05,11.81]
[149,"NORTH GEM DISTRICT",800469277,826001137,11738.74,17.25,13575.77,28700.07,0,33902.31,11377.36,null,149,"NORTH GEM DISTRICT",11738.74,17.25,13575.77,28700.07,0,33902.31,11377.36]
[480,"NORTH IDAHO STEM CHARTER ACADEMY, INC.",14744681,271042057,1440,0,4390.55,0,191587.58000000002,0,0,null,480,"NORTH IDAHO STEM CHARTER ACADEMY, INC.",1440,0,4390.55,0,191587.58000000002,0,0]
[493,"NORTH STAR CHARTER SCHOOL, INC.",114313609,113643458,852.49,0,6433.19,0,284792.93,0,0,null,493,"NORTH STAR CHARTER SCHOOL, INC.",852.49,0,6433.19,0,284792.93,0,0]
[465,"NORTH VALLEY ACADEMY, INC.",830799883,260820021,1150,0,0,39357.910000000003,0,104137.43,0,null,465,"NORTH VALLEY ACADEMY, INC.",1150,0,0,39357.910000000003,0,104137.43,0]
[135,"NOTUS DISTRICT",100015239,826002944,8356.49,0,0,233134.95,0,196639.27,115468.07,null,135,"NOTUS DISTRICT",8356.49,0,0,233134.95,0,196639.27,115468.07]
[351,"ONEIDA COUNTY DISTRICT",100015247,826000844,1306,114.48,38357,300562.26000000007,0,104823.42,0,null,351,"ONEIDA COUNTY DISTRICT",1306,114.48,38357,300562.26000000007,0,104823.42,0]
[171,"OROFINO JOINT DISTRICT",97241129,826000734,2678.19,175.21,0,341756.37,0,1207691.96,73473.850000000006,null,171,"OROFINO JOINT DISTRICT",2678.19,175.21,0,341756.37,0,1207691.96,73473.850000000006]
[472,"PALOUSE PRAIRIE EDUCATIONAL ORGANIZATION, INC.",609526947,208870679,444.25,15.83,6478.12,20481.95,0,65211.11,11801.34,null,472,"PALOUSE PRAIRIE EDUCATIONAL ORGANIZATION, INC.",444.25,15.83,6478.12,20481.95,0,65211.11,11801.34]
[137,"PARMA DISTRICT",100015254,826003335,708.66,158.94999999999999,0,129830.66,0,498355.29999999993,92616.24,null,137,"PARMA DISTRICT",708.66,158.94999999999999,0,129830.66,0,498355.29999999993,92616.24]
[497,"PATHWAYS IN EDUCATION - NAMPA, INC.",80600403,814963154,410.55,0,8217.41,109290,16407.490000000002,0,9060,null,497,"PATHWAYS IN EDUCATION - NAMPA, INC.",410.55,0,8217.41,109290,16407.490000000002,0,9060]
[371,"PAYETTE JOINT DISTRICT",181918483,826000862,5891.8399999999992,369.45,0,53842.32,0,746389.32,378466.89999999997,null,371,"PAYETTE JOINT DISTRICT",5891.8399999999992,369.45,0,53842.32,0,746389.32,378466.89999999997]
[794,"PAYETTE RIVER TECHNICAL ACADEMY, INC.",965786168,271285798,4590,0,0,0,0,0,0,null,794,"PAYETTE RIVER TECHNICAL ACADEMY, INC.",4590,0,0,0,0,0,0]
[511,"PEACE VALLEY CHARTER SCHOOL, INC.",80965852,814365929,2795.18,14.93,41796.910000000003,61267.32,72023,50346.759999999995,36436.28,null,511,"PEACE VALLEY CHARTER SCHOOL, INC.",2795.18,14.93,41796.910000000003,61267.32,72023,50346.759999999995,36436.28]
[553,"PINECREST ACADEMY OF IDAHO, INC.",117180145,842768672,2451.06,0,0,0,144285.83000000002,0,0,null,553,"PINECREST ACADEMY OF IDAHO, INC.",2451.06,0,0,0,144285.83000000002,0,0]
[364,"PLEASANT VALLEY ELEMENTARY DISTRICT",179267117,826000847,0,0,6402.97,0,94756.4,0,0,null,364,"PLEASANT VALLEY ELEMENTARY DISTRICT",0,0,6402.97,0,94756.4,0,0]
[44,"PLUMMER-WORLEY JOINT DISTRICT",621456672,826000613,3675.03,241.03,0,752267.29999999993,0,148213.38,98164.25,null,44,"PLUMMER-WORLEY JOINT DISTRICT",3675.03,241.03,0,752267.29999999993,0,148213.38,98164.25]
[25,"POCATELLO DISTRICT",29614922,826000591,20863.16,2190.5700000000002,0,19155.34,0,10305028.09,977898.7699999999,null,25,"POCATELLO DISTRICT",20863.16,2190.5700000000002,0,19155.34,0,10305028.09,977898.7699999999]
[273,"POST FALLS DISTRICT",76666767,826000813,294.52,0,0,294283.53999999998,0,2554761.2999999998,1314137.79,null,273,"POST FALLS DISTRICT",294.52,0,0,294283.53999999998,0,2554761.2999999998,1314137.79]
[285,"POTLATCH DISTRICT",100599133,826000817,8269.94,52.09,0,62780.479999999989,0,404359.48999999993,25473.599999999999,null,285,"POTLATCH DISTRICT",8269.94,52.09,0,62780.479999999989,0,404359.48999999993,25473.599999999999]
[191,"Prairie Elementary District",159147461,826001384,0,0,0,0,0,0,0,null,191,"Prairie Elementary District",0,0,0,0,0,0,0]
[201,"PRESTON JOINT DISTRICT",157817024,826000749,0,0,0,0,0,183232.57,71745.61,null,201,"PRESTON JOINT DISTRICT",0,0,0,0,0,183232.57,71745.61]
[513,"PROJECT IMPACT STEM ACADEMY, INC.",80846237,821955574,324.20999999999998,0,0,361.77,72653,155169.72,9613.2200000000012,null,513,"PROJECT IMPACT STEM ACADEMY, INC.",324.20999999999998,0,0,361.77,72653,155169.72,9613.2200000000012]
[316,"RICHFIELD DISTRICT",29825924,826001279,7625.75,0,0,38964.85,0,61109.24,8698.36,null,316,"RICHFIELD DISTRICT",7625.75,0,0,38964.85,0,61109.24,8698.36]
[252,"RIRIE JOINT DISTRICT",926460742,820259363,3590.29,44.36,5853.29,0,0,19024.759999999998,18150.150000000001,null,252,"RIRIE JOINT DISTRICT",3590.29,44.36,5853.29,0,0,19024.759999999998,18150.150000000001]
[382,"ROCKLAND DISTRICT",100187848,826000866,8483,3018.42,6657.05,64899.97,0,47574.78,5280.1900000000005,null,382,"ROCKLAND DISTRICT",8483,3018.42,6657.05,64899.97,0,47574.78,5280.1900000000005]
[454,"ROLLING HILLS PUBLIC CHARTER SCHOOL, INC.",938170441,201868297,318.87,25.01,1008.63,10300.64,53877.38,228853.49000000005,56252.270000000004,null,454,"ROLLING HILLS PUBLIC CHARTER SCHOOL, INC.",318.87,25.01,1008.63,10300.64,53877.38,228853.49000000005,56252.270000000004]
[291,"SALMON DISTRICT",100015296,826000821,1847.44,209.55,0,197743.47,0,0,11533,null,291,"SALMON DISTRICT",1847.44,209.55,0,197743.47,0,0,11533]
[243,"SALMON RIVER JOINT SCHOOL DISTRICT",806404062,593838650,2617.13,31.22,1660.97,265.47000000000003,85053,212350.05,53045.33,null,243,"SALMON RIVER JOINT SCHOOL DISTRICT",2617.13,31.22,1660.97,265.47000000000003,85053,212350.05,53045.33]
[487,"SANDPOINT CHARTER SCHOOL, INC.",94295685,820505769,407.29,65.22,0,72019.960000000006,0,216769.79,17827.04,null,487,"SANDPOINT CHARTER SCHOOL, INC.",407.29,65.22,0,72019.960000000006,0,216769.79,17827.04]
[60,"SHELLEY JOINT DISTRICT",181965740,826000619,3774.19,218.05,8947.42,166905.79999999999,0,1215323.74,318883.53000000003,null,60,"SHELLEY JOINT DISTRICT",3774.19,218.05,8947.42,166905.79999999999,0,1215323.74,318883.53000000003]
[312,"SHOSHONE JOINT DISTRICT",193218260,826003374,479.87,87.26,0,0,0,44512.21,110790.87999999999,null,312,"SHOSHONE JOINT DISTRICT",479.87,87.26,0,0,0,44512.21,110790.87999999999]
[52,"SNAKE RIVER DISTRICT",29628674,826000615,0,0,0,111964.67,0,2184.37,171.59,null,52,"SNAKE RIVER DISTRICT",0,0,0,111964.67,0,2184.37,171.59]
[150,"SODA SPRINGS JOINT DISTRICT",878896901,826000731,764.3,81.87,482.93,6170.9,0,100341.14,7117.78,null,150,"SODA SPRINGS JOINT DISTRICT",764.3,81.87,482.93,6170.9,0,100341.14,7117.78]
[292,"SOUTH LEMHI DISTRICT",100187988,826000822,2552.98,20.28,14.28,2563.86,67298.540000000008,58069.259999999995,30400.080000000002,null,292,"SOUTH LEMHI DISTRICT",2552.98,20.28,14.28,2563.86,67298.540000000008,58069.259999999995,30400.080000000002]
[41,"ST MARIES JOINT DISTRICT",10205979,826000612,66.58,51543.77,0,530594.99,0,802903.01,196572.39,null,41,"ST MARIES JOINT DISTRICT",66.58,51543.77,0,530594.99,0,802903.01,196572.39]
[322,"SUGAR-SALEM JOINT DISTRICT",58571670,826000836,0,142.35,855.3,255261.08,0,113368.71999999997,253003.09999999998,null,322,"SUGAR-SALEM JOINT DISTRICT",0,142.35,855.3,255261.08,0,113368.71999999997,253003.09999999998]
[92,"SWAN VALLEY ELEMENTARY DISTRICT",803155381,826000681,606.93999999999994,0,561.03,0,113655.49,0,0,null,92,"SWAN VALLEY ELEMENTARY DISTRICT",606.93999999999994,0,561.03,0,113655.49,0,0]
[488,"SYRINGA MOUNTAIN SCHOOL, INC.",79390538,352450616,37.61,20.76,0,29861.09,0,124147.61,18347.919999999998,null,488,"SYRINGA MOUNTAIN SCHOOL, INC.",37.61,20.76,0,29861.09,0,124147.61,18347.919999999998]
[461,"TAYLOR'S CROSSING PUBLIC CHARTER SCHOOL, INC.",797535601,202701493,2606,42.34,424.86,23185.26,0,84450.099999999991,0,null,461,"TAYLOR'S CROSSING PUBLIC CHARTER SCHOOL, INC.",2606,42.34,424.86,23185.26,0,84450.099999999991,0]
[401,"TETON COUNTY DISTRICT",100599166,826000887,1057.8399999999999,210.97,160.88999999999999,1844.79,0,362287.71,168649.31,null,401,"TETON COUNTY DISTRICT",1057.8399999999999,210.97,160.88999999999999,1844.79,0,362287.71,168649.31]
[460,"THE ACADEMY, INC.",783840858,412193534,498.96999999999997,55028.45,0,0,0,0,0,null,460,"THE ACADEMY, INC.",498.96999999999997,55028.45,0,0,0,0,0]
[470,"The Kootenai Bridge Academy, Inc.",831646554,263573121,0,0,0,0,0,0,0,null,470,"The Kootenai Bridge Academy, Inc.",0,0,0,0,0,0,0]
[494,"THE POCATELLO COMMUNITY CHARTER SCHOOL, INC.",113912443,820506158,3929.8900000000003,46.61,0,512.25,0,190511.94,78956.48000000001,null,494,"THE POCATELLO COMMUNITY CHARTER SCHOOL, INC.",3929.8900000000003,46.61,0,512.25,0,190511.94,78956.48000000001]
[475,"THE SAGE INTERNATIONAL SCHOOL OF BOISE, A PUBLIC CHARTER SCHOOL, INC.",32655155,270169469,569.69000000000005,93.98,35988.1,329058.11,0,142205.46,51471.34,null,475,"THE SAGE INTERNATIONAL SCHOOL OF BOISE, A PUBLIC CHARTER SCHOOL, INC.",569.69000000000005,93.98,35988.1,329058.11,0,142205.46,51471.34]
[473,"THE VILLAGE CHARTER SCHOOL, INC.",968901947,270716284,3121.19,31.77,0,0,0,93955,69906.06,null,473,"THE VILLAGE CHARTER SCHOOL, INC.",3121.19,31.77,0,0,0,93955,69906.06]
[559,"THOMAS JEFFERSON CHARTER SCHOOL, INC.",784840469,200508843,472,17.829999999999998,0,0,14529.36,6183.71,325,null,559,"THOMAS JEFFERSON CHARTER SCHOOL, INC.",472,17.829999999999998,0,0,14529.36,6183.71,325]
[416,"THREE CREEK JOINT ELEMENTARY DISTRICT",193613791,826001249,0,0,0,0,0,0,0,null,416,"THREE CREEK JOINT ELEMENTARY DISTRICT",0,0,0,0,0,0,0]
[532,"TREASURE VALLEY CLASSICAL ACADEMY, INC.",81137699,814720145,11430.3,2231.4299999999998,53522.59,175433.78,0,0,8311.82,null,532,"TREASURE VALLEY CLASSICAL ACADEMY, INC.",11430.3,2231.4299999999998,53522.59,175433.78,0,0,8311.82]
[287,"TROY SCHOOL DISTRICT",824948165,820530483,0,0,0,43.08,0,37311.42,29429.62,null,287,"TROY SCHOOL DISTRICT",0,0,0,43.08,0,37311.42,29429.62]
[411,"TWIN FALLS DISTRICT",100015353,826000892,4227.57,1541.68,0,1646195.11,0,3970009.38,1147718.01,null,411,"TWIN FALLS DISTRICT",4227.57,1541.68,0,1646195.11,0,3970009.38,1147718.01]
[486,"UPPER CARMEN PUBLIC CHARTER SCHOOL, INC.",186273954,760782276,0,0,1639.39,0,38699.19,0,0,null,486,"UPPER CARMEN PUBLIC CHARTER SCHOOL, INC.",0,0,1639.39,0,38699.19,0,0]
[262,"VALLEY DISTRICT",800469400,826001371,738.03,71.22,0,83666.83,0,146135.15,143044.12,null,262,"VALLEY DISTRICT",738.03,71.22,0,83666.83,0,146135.15,143044.12]
[139,"VALLIVUE SCHOOL DISTRICT",155896269,826001904,5943,1041.05,411.08,3204007.42,0,4275956.51,207206.36000000002,null,139,"VALLIVUE SCHOOL DISTRICT",5943,1041.05,411.08,3204007.42,0,4275956.51,207206.36000000002]
[451,"VICTORY CHARTER SCHOOL, INC.",195571505,562423033,393.72,42.56,981.8,319.39999999999998,0,296.02999999999997,18846.759999999998,null,451,"VICTORY CHARTER SCHOOL, INC.",393.72,42.56,981.8,319.39999999999998,0,296.02999999999997,18846.759999999998]
[463,"VISION CHARTER SCHOOL, INC.",7896716,680609551,2795.19,61.32,1835.92,28543.439999999999,0,134867.13,108560.55,null,463,"VISION CHARTER SCHOOL, INC.",2795.19,61.32,1835.92,28543.439999999999,0,134867.13,108560.55]
[393,"WALLACE DISTRICT",47780739,826000886,481.28000000000003,116.9,0,337217.13,0,2027.22,96315.049999999988,null,393,"WALLACE DISTRICT",481.28000000000003,116.9,0,337217.13,0,2027.22,96315.049999999988]
[431,"WEISER DISTRICT",181914961,826000920,194.73,0,0,329722.83,0,213566.8,105315.11,null,431,"WEISER DISTRICT",194.73,0,0,329722.83,0,213566.8,105315.11]
[232,"WENDELL DISTRICT",100015379,826004158,4932,158.72,0,61070.950000000004,0,947473.17,76745,null,232,"WENDELL DISTRICT",4932,158.72,0,61070.950000000004,0,947473.17,76745]
[83,"WEST BONNER COUNTY DISTRICT",98834174,820508740,0,61700.88,0,970676.82000000007,0,0,498139.62,null,83,"WEST BONNER COUNTY DISTRICT",0,61700.88,0,970676.82000000007,0,0,498139.62]
[253,"WEST JEFFERSON DISTRICT",122332075,820379941,682.96,73.97,0,0,0,78169.19,130353,null,253,"WEST JEFFERSON DISTRICT",682.96,73.97,0,0,0,78169.19,130353]
[202,"WEST SIDE JOINT DISTRICT",825388556,826000750,584.38,60.53,1504.7,127722.62,0,476692,119173,null,202,"WEST SIDE JOINT DISTRICT",584.38,60.53,1504.7,127722.62,0,476692,119173]
[464,"WHITE PINE CHARTER SCHOOL, INC.",170300300,680502170,2795.19,38.58,2007.62,369.41,0,342.38,26.89,null,464,"WHITE PINE CHARTER SCHOOL, INC.",2795.19,38.58,2007.62,369.41,0,342.38,26.89]
[288,"WHITEPINE JOINT SCHOOL DISTRICT",37409539,820530482,0,0,449.94,7035.7000000000007,0,188578.38999999998,45857.120000000003,null,288,"WHITEPINE JOINT SCHOOL DISTRICT",0,0,449.94,7035.7000000000007,0,188578.38999999998,45857.120000000003]
[133,"WILDER DISTRICT",29650553,826003336,490.13,184.12,0,229398.93,0,591047.92999999993,179376.13000000003,null,133,"WILDER DISTRICT",490.13,184.12,0,229398.93,0,591047.92999999993,179376.13000000003]
[462,"XAVIER CHARTER SCHOOL, INC.",3514777,205009576,1584,0,256.56,58196.37,0,77732.399999999994,62198.779999999992,null,462,"XAVIER CHARTER SCHOOL, INC.",1584,0,256.56,58196.37,0,77732.399999999994,62198.779999999992]
[4,"Test LEA",11011,11011,10000,5000,3000,8000,null,null,0]

{"sheet":"Prior","index":10,"n_rows":186,"n_cols":11,"rows_kept":186,"cut":false,"hidden":false,"merged":[]}
["ID","Name","DUNS","vendor","CARES Set Aside (LMS and SEL)","CARES Flow Through","CRRSA Set Aside","CRRSA Flow Through","ARP Set Aside","ARP Flow Through","ARP Learning Loss"]
[58,"ABERDEEN DISTRICT",801867284,826000617,7225,133747,0,338379.79,0,479541.74,86565.35]
[495,"ALTURAS INTERNATIONAL ACADEMY, INC.",71549639,473126055,3143,52859,0,181201.58000000002,0,0,0]
[560,"ALTURAS PREPARATORY ACADEMY, INC",36487482,853948402,0,0,0,96355,0,41530.120000000003,4566.45]
[381,"AMERICAN FALLS JOINT DISTRICT",144756442,826000865,20647.12,295670,0,1082536.31,0,705325.07000000007,203355.12]
[482,"AMERICAN HERITAGE CHARTER SCHOOL, INC.",79082049,453753476,12035,24472.12,0,31429.71,0,0,0]
[492,"ANSER OF IDAHO, INC.",832063890,841390547,0,19479,0,128805.88,0,0,65126.95]
[383,"ARBON ELEMENTARY DISTRICT",189339153,826003195,4158,0,761.22,0,0,0,0]
[394,"AVERY SCHOOL DISTRICT",100599109,826001332,7959,0,0,0,76282.14,0,0]
[72,"BASIN SCHOOL DISTRICT",100014778,826000632,11634,38281,0,213315.80000000002,0,186675.32,95857]
[33,"BEAR LAKE COUNTY DISTRICT",183893577,826001400,21083,148828,17223,594060,0,0,0]
[477,"BLACKFOOT CHARTER COMMUNITY LEARNING CENTER, INC.",142291967,820524579,5635.85,83392,0,266217.76,0,0,103127.01]
[55,"BLACKFOOT DISTRICT",607630415,826000616,25888.82,470219,0,2260354.08,0,1521400.88,770526.42]
[61,"BLAINE COUNTY DISTRICT",794328906,826001220,32610.15,239654,0,0,0,0,0]
[234,"BLISS JOINT DISTRICT",40197688,826000767,688.22000000000014,28844,1119.6300000000001,75163.320000000007,106503.17,0,21437.850000000002]
[1,"Boise Independent District",122740046,826000549,283938,3810114,0,5325500.68,0,0,380332.88]
[93,"BONNEVILLE JOINT DISTRICT",879016822,826001206,156531,1256253,624498,5014437,0,459929.55999999994,934892.49]
[101,"BOUNDARY COUNTY DISTRICT",10206712,826000683,23443,272046.63,0,713677.67000000016,0,53911.15,0]
[365,"BRUNEAU-GRAND VIEW JOINT SCHOOL DISTRICT",29868007,826001219,4408,95113,0,328336.90000000002,0,100736.84,0]
[412,"BUHL JOINT DISTRICT",100014851,826000893,21629,256476,0,725367.35999999987,0,0,0]
[111,"BUTTE COUNTY JOINT DISTRICT",29645454,826000685,2818,23565.52,0,0,0,0,0]
[132,"CALDWELL DISTRICT",100014869,826000728,0,1593025,0,3251425.96,0,0,0]
[121,"CAMAS COUNTY DISTRICT",100185412,826000686,9660,17694,26370,86270,10455,0,38767]
[432,"CAMBRIDGE JOINT DISTRICT",112893883,826000921,9140,38737,0,27121.18,0,25972.83,3377.35]
[555,"CANYON-OWYHEE SCHOOL SERVICE AGENCY (COSSA)",29765393,820299347,9158,0,60836,0,0,0,0]
[566,"CARDINAL ACADEMY INCORPORATED",108110500,861222191,0,0,0,57285.479999999996,0,31840.260000000002,27763]
[422,"CASCADE DISTRICT",100014885,826000907,8132,138110,0,373421.82,0,436.98,12065.880000000001]
[151,"CASSIA COUNTY JOINT DISTRICT",879016707,826000732,66943,733210.99999999988,0,2345721.06,0,2702426.95,676.48]
[417,"CASTLEFORD DISTRICT",181912668,826000891,10326.939999999999,56054,0,210868,0,23412.82,21086.57]
[181,"CHALLIS JOINT DISTRICT",193218112,826000736,11255,71315,0,452661.89,0,0,0]
[483,"CHIEF TAHGEE ELEMENTARY ACADEMY, INC.",78351211,453150830,8717,25082,0,89844.82,22116.66,79350.02,20269.099999999999]
[161,"CLARK COUNTY DISTRICT",24714961,826000733,4290,25195,0,63646.33,0,15440.02,0]
[491,"COEUR D'ALENE CHARTER ACADEMY, INC.",128705576,820509670,0,0,130578.84,0,0,0,0]
[271,"COEUR D'ALENE DISTRICT",85188761,826000811,92987.18,1672719.37,0,4132816.41,0,1372198.48,95409.709999999992]
[455,"COMPASS PUBLIC CHARTER SCHOOL, INC.",165024576,731729632,20371,50212,203944,270534,0,80106.290000000008,67510.73000000001]
[242,"COTTONWOOD JOINT DISTRICT",100014901,826003404,11981,65659,0,256015,0,91044.03,71514.89]
[13,"COUNCIL DISTRICT",100185610,826004153,10669,41932,0,184392.14,0,0,0]
[342,"CULDESAC JOINT DISTRICT",92284785,826001189,9134,25115.999999999996,8999,0,0,0,0]
[314,"DIETRICH DISTRICT",29816998,826003139,10169,33683,0,0,0,78885.03,3365.0000000000005]
[550,"DORAL ACADEMY OF IDAHO, INC.",117165868,842149691,2411,0,0,43765,0,49009.310000000005,19666]
[523,"ELEVATE ACADEMY INC.",18395435,823036828,11146,66630,0,147748.08000000002,0,0,0]
[221,"EMMETT INDEPENDENT DISTRICT",7643034,826001228,19514.12,507747,0,1773004.96,0,494240.49,110730.81]
[456,"FALCON RIDGE PUBLIC CHARTER SCHOOL, INC.",182860341,270095874,2585,24379,38295,0,0,0,0]
[531,"FERN-WATERS PUBLIC CHARTER SCHOOL, INC.",116915742,824261500,8230.77,0,0,67809.02,9910.8700000000008,126076.99,9408.36]
[413,"FILER DISTRICT",100014943,826000894,0,203432.35,0,0,0,0,0]
[59,"FIRTH DISTRICT",100014950,826000618,16914,65437.000000000007,85114,179883.22,0,0,32860.400000000001]
[528,"FORGE INTERNATIONAL, LLC",116766344,352643363,10539,21511,30041.5,105913.25,0,191847.95,56205]
[215,"FREMONT COUNTY JOINT DISTRICT",184556975,826000751,29728.9,419917,0,1712893.9999999998,0,189961.16999999998,338022.02]
[373,"FRUITLAND DISTRICT",100014968,826000864,20397,171463,20069.3,180161.46,0,700529.94,0]
[499,"FUTURE PUBLIC SCHOOL, INC.",80975896,822354868,4801,45830.559999999998,0,128700.68,0,0,0]
[71,"GARDEN VALLEY DISTRICT",29632296,826000631,11019,81561,0,169069.65,0,317887.14,46085.03]
[549,"GEM PREP: MERIDIAN NORTH, LLC",117200585,842329869,0,0,0,66567,65381,109099.96,15368.07]
[498,"GEM PREP: MERIDIAN, LLC",81046990,371848621,11849,58351,0,226709.09,0,256212.35,10139.050000000001]
[796,"GEM PREP: NAMPA, LLC",81304980,473817130,12452.64,0,146055,58430.979999999996,0,316704.26,12501.45]
[534,"GEM PREP: ONLINE LLC",117035032,834122757,11151.47,99043,0,229185.72,0,609445,16217.039999999999]
[496,"GEM PREP: POCATELLO, LLC",80511840,473829757,10944.61,55241,0,246141.43,0,351760.15,9048.07]
[282,"GENESEE JOINT DISTRICT",100185818,826000815,11200,36501,0,125372.81,0,0,0]
[192,"GLENS FERRY JOINT DISTRICT",605581743,826002941,0,96044,0,274333.86,0,216105.5,132320.58000000002]
[231,"GOODING JOINT DISTRICT",29720992,826000771,11511.039999999999,233806,0,811617.49,0,300571.71999999997,51639.229999999996]
[148,"GRACE JOINT DISTRICT",29651205,826000730,0,52251,59358,208565,0,0,0]
[233,"HAGERMAN JOINT DISTRICT",193089125,826001373,11049,61516,0,223871.46000000002,0,36013,79703.41]
[415,"HANSEN DISTRICT",100015015,826001325,2690,80919,0,40245.15,0,557.78,80799.53]
[508,"HAYDEN CANYON CHARTER SCHOOL, INC.",80998762,462661679,11356,16053,23969,91336,0,0,0]
[479,"HERITAGE ACADEMY, INC.",69071435,273203580,9108,45248,0,167928.71000000002,0,185209.92,42825.95]
[481,"HERITAGE COMMUNITY CHARTER SCHOOL, INC.",58025766,273220966,2947,101727,0,322187.11,0,0,0]
[305,"HIGHLAND JOINT DISTRICT",193083409,820255978,764.74,28618,0,55851.72,0,0,0]
[370,"HOMEDALE JOINT DISTRICT",100186048,826000860,21011,241756,0,0,0,94980.02,78765.37]
[73,"HORSESHOE BEND SCHOOL DISTRICT",949307193,826000626,2529,41670.000000000007,0,166331,0,67107.73000000001,26299.149999999998]
[795,"IDAHO ARTS CHARTER SCHOOL, INC.",191501993,201616506,4520,0,395853,565251.65,0,0,0]
[596,"IDAHO BUREAU OF EDUCATIONAL SERVICES FOR THE DEAF AND THE BLIND",78569416,272336046,6395.5,0,0,0,0,0,0]
[489,"IDAHO COLLEGE AND CAREER READINESS ACADEMY, INC.",79255786,462298596,9737,0,115933,0,160489.18,0,0]
[91,"IDAHO FALLS DISTRICT",29642717,826001158,119108,1653524,0,1146322.6599999999,0,1943036.25,0]
[468,"IDAHO SCIENCE AND TECHNOLOGY CHARTER SCHOOL, INC.",826960853,262852741,11746,43445,0,245444,0,141177,110294]
[485,"IDAHO STEM ACADEMY, INC.",78455129,274587929,0,17447,0,43218.6,0,98717.94,3174]
[452,"IDAHO VIRTUAL ACADEMY, INC.",793722781,10720150,26561,436726,5233959.3499999996,1393059.74,0,338978.52,397522.65]
[469,"IDAHO VIRTUAL EDUCATION PARTNERS, INC.",832251305,263814847,0,0,29307.3,0,0,0,0]
[453,"IDAHO VIRTUAL HIGH SCHOOL, INC.",170660455,10577656,13020,0,235476,0,0,0,0]
[457,"INSPIRE ACADEMICS, INC.",797530305,202193239,4640,151299,871112.06,759082.12000000011,0,0,0]
[540,"ISLAND PARK CHARTER SCHOOL, INC.",117224934,831266928,7904,0,3688.14,0,0,0,0]
[466,"ISUCCEED VIRTUAL HIGH SCHOOL, INC.",878662498,262224774,0,0,0,8542.51,0,0,0]
[251,"JEFFERSON COUNTY JOINT DISTRICT",29738903,826000779,64076.32,544080,533342,2020541,0,0,0]
[261,"JEROME JOINT DISTRICT",100015056,826003634,52645,648871,0,1079708.2999999998,0,113240.79000000001,179656]
[2,"JOINT SCHOOL DISTRICT NO. 2",29604402,826001213,434427.08999999997,3058770.3600000003,0,3517013.58,0,0,431771.05]
[304,"KAMIAH JOINT DISTRICT",159151398,826004161,9433.93,254012.09,0,72732.53,0,573513.77,163947.60999999999]
[391,"KELLOGG JOINT DISTRICT",100186402,826000884,0,263688,0,1052532,0,786491.59000000008,0]
[283,"KENDRICK JOINT DISTRICT",100646397,826000816,4620.05,28652.68,0,0,0,0,0]
[414,"KIMBERLY DISTRICT",879016921,826000895,30485,139975,219360.73,377412.2,0,0,136891.32999999999]
[274,"KOOTENAI DISTRICT",100646405,826003651,9537,43657,0,124837.23999999999,0,80968.649999999994,33599.370000000003]
[3,"KUNA JOINT DISTRICT",100015072,826001275,68579,852154,0,1664892.36,0,0,312409.91000000003]
[84,"LAKE PEND OREILLE SCHOOL DISTRICT",832156884,820508739,14180,569277,0,2547598.0000000005,0,644692.10999999987,547667.97]
[272,"LAKELAND DISTRICT",100015080,826000812,57457,750019,0,2020840.3699999999,0,0,0]
[341,"LAPWAI DISTRICT",100015098,826000843,11991,148948,0,554661,0,198785.39,0]
[478,"LEGACY PUBLIC CHARTER SCHOOL, INC.",968870522,272515468,11231,36122,6000,127916.83,0,162985.56,22786.080000000002]
[340,"LEWISTON INDEPENDENT DISTRICT",100186600,826000839,34024.35,632815,0,2280468.4900000002,0,141083.07,383653.77]
[458,"LIBERTY CHARTER SCHOOL, INC.",105529221,820512446,12198,42040,0,144311,0,236412.93,34248.120000000003]
[182,"MACKAY JOINT DISTRICT",25531166,826000738,0,11021.17,0,0,0,0,0]
[321,"MADISON DISTRICT",100646413,826000835,66444,823425,0,3431434,0,1303169.8999999999,494449.11]
[21,"MARSH VALLEY JOINT DISTRICT",193088374,826000590,22203,164905,0,672889,0,172965.6,224641.8]
[363,"MARSING JOINT DISTRICT",86812005,826000855,17386,228087,0,799610.14999999991,0,0,0]
[421,"MCCALL-DONNELLY JOINT SCHOOL DISTRICT",100599125,826000906,22781,104889,120868.82,252248.21,0,364682.36,59077.83]
[11,"MEADOWS VALLEY DISTRICT",100015122,826000583,2338,43152.71,0,89684.88,0,0,0]
[136,"MELBA JOINT DISTRICT",184973659,826001130,17216,95494,42398,244955,0,0,0]
[785,"MERIDIAN MEDICAL ARTS CHARTER HIGH SCHOOL, INC.",67651558,571149368,7026.71,0,75045.009999999995,0,0,0,0]
[768,"MERIDIAN TECHNICAL CHARTER HIGH SCHOOL, INC.",44111453,820512811,9899,0,38464.14,0,0,0,0]
[134,"MIDDLETON DISTRICT",29646403,826003508,51820,294748,449390,0,0,0,0]
[433,"MIDVALE DISTRICT",183894732,826001364,2250,27448,7462,108037.84999999999,0,168704.52,5399.89]
[331,"MINIDOKA COUNTY JOINT DISTRICT",100015171,826000837,56149,635416,0,2137633.79,0,0,842508]
[474,"MONTICELLO MONTESSORI CHARTER SCHOOL, INC.",961942005,270186469,2566,36687,0,126571.04,0,100482.12999999999,162.4]
[544,"MOSAICS PUBLIC SCHOOL, INC.",117130660,832231987,11287,18312,0,91729.819999999992,0,0,0]
[813,"MOSCOW CHARTER SCHOOL, INC.",93632698,820505459,2408,0,41189.85,0,0,0,0]
[281,"MOSCOW DISTRICT",29785391,826000814,25265,283757.78999999998,0,841189.48,0,41999.08,82331.459999999992]
[193,"MOUNTAIN HOME DISTRICT",127655744,826000742,50227,633943,0,655600.48,0,0,750563.01]
[244,"MOUNTAIN VIEW SCHOOL DISTRICT",76641414,593838651,7356.86,206072,0,440449.29000000004,0,134828.95000000001,0]
[392,"MULLAN DISTRICT",100015197,826000885,7917.21,43493,0,54880.83,0,0,0]
[418,"MURTAUGH JOINT DISTRICT",192846512,826000890,11665,33010,43771,154453,0,11325.150000000001,0]
[131,"NAMPA SCHOOL DISTRICT",29646478,826000727,163772.67000000001,3411509.79,0,7905900.870000001,0,1411838.9200000002,1088758.53]
[372,"NEW PLYMOUTH DISTRICT",29880812,826000863,18268,158761,0,419152.99,0,23371.79,10253.780000000001]
[302,"NEZPERCE JOINT DISTRICT",794728741,826001370,9466,18066,0,0,0,27297.940000000002,32406]
[149,"NORTH GEM DISTRICT",800469277,826001137,755.08,16796,0,31028,0,0,0]
[480,"NORTH IDAHO STEM CHARTER ACADEMY, INC.",14744681,271042057,14103,0,210266,0,0,0,0]
[493,"NORTH STAR CHARTER SCHOOL, INC.",114313609,113643458,18397,0,308089,0,64350.07,0,0]
[465,"NORTH VALLEY ACADEMY, INC.",830799883,260820021,9163.9500000000007,39537,0,98297.459999999992,0,160000,0]
[135,"NOTUS DISTRICT",100015239,826002944,0,74056,0,24306.91,0,0,0]
[351,"ONEIDA COUNTY DISTRICT",100015247,826000844,43797,111483,1837077,0,0,0,158706.6]
[171,"OROFINO JOINT DISTRICT",97241129,826000734,20597,170620,0,421545.53,0,51910.510000000009,39587.090000000004]
[472,"PALOUSE PRAIRIE EDUCATIONAL ORGANIZATION, INC.",609526947,208870679,9604.75,15419,19705.43,40053.93,0,16638.48,13334.240000000002]
[137,"PARMA DISTRICT",100015254,826003335,19102,154788,0,432539.07,0,0,0]
[497,"PATHWAYS IN EDUCATION - NAMPA, INC.",80600403,814963154,10608.439999999999,0,14194,12480,0,49930,1426]
[371,"PAYETTE JOINT DISTRICT",181918483,826000862,18003,359766,0,1385423.3,0,0,267073.31]
[794,"PAYETTE RIVER TECHNICAL ACADEMY, INC.",965786168,271285798,0,0,75218,0,0,0,0]
[511,"PEACE VALLEY CHARTER SCHOOL, INC.",80965852,814365929,11154,14534,0,19968.020000000004,0,95513.25,0]
[553,"PINECREST ACADEMY OF IDAHO, INC.",117180145,842768672,0,0,35067.449999999997,0,66886.959999999992,0,0]
[364,"PLEASANT VALLEY ELEMENTARY DISTRICT",179267117,826000847,2044,0,0,0,0,0,0]
[44,"PLUMMER-WORLEY JOINT DISTRICT",621456672,826000613,8567,234711,0,186710.36,0,0,26316.46]
[25,"POCATELLO DISTRICT",29614922,826000591,130413.7,2133161,0,8514692,0,205464.11,186271.81]
[273,"POST FALLS DISTRICT",76666767,826000813,74683,950153,0,3332303.81,0,659089.69999999995,311867.20999999996]
[285,"POTLATCH DISTRICT",100599133,826000817,5128,50726,10867,71082.92,0,25647.75,22879.78]
[191,"Prairie Elementary District",159147461,826001384,0,0,0,0,0,0,0]
[201,"PRESTON JOINT DISTRICT",157817024,826000749,33250,193327,112029,848204,0,0,0]
[513,"PROJECT IMPACT STEM ACADEMY, INC.",80846237,821955574,10017,33438,0,160811,0,127726.93000000001,36168.32]
[316,"RICHFIELD DISTRICT",29825924,826001279,2439,39575,0,0,0,61105.740000000005,72399.64]
[252,"RIRIE JOINT DISTRICT",926460742,820259363,12737,43201,130042,168893,0,0,15081.779999999999]
[382,"ROCKLAND DISTRICT",100187848,826000866,0,15421.5,0,22871.11,0,0,0]
[454,"ROLLING HILLS PUBLIC CHARTER SCHOOL, INC.",938170441,201868297,10408,24355,0,121927.16,0,0,0]
[291,"SALMON DISTRICT",100015296,826000821,14830,204058,0,411281.91999999998,0,0,0]
[243,"SALMON RIVER JOINT SCHOOL DISTRICT",806404062,593838650,6910,30401,0,118002,0,0,0]
[487,"SANDPOINT CHARTER SCHOOL, INC.",94295685,820505769,11157,63506,0,182039.31,0,0,15776.96]
[60,"SHELLEY JOINT DISTRICT",181965740,826000619,32969,212333.28,100055.1,682549.90999999992,0,247758.52000000002,62114.29]
[312,"SHOSHONE JOINT DISTRICT",193218260,826003374,13043,84976,0,95790.35,0,149451.98000000001,36487.68]
[52,"SNAKE RIVER DISTRICT",29628674,826000615,27461,305852,0,938002.12,0,1883040,470760]
[150,"SODA SPRINGS JOINT DISTRICT",878896901,826000731,17923,79724,87055,312769,0,0,0]
[292,"SOUTH LEMHI DISTRICT",100187988,826000822,4753,19744,33666.720000000001,65213.270000000004,0,63625.75,0]
[41,"ST MARIES JOINT DISTRICT",10205979,826000612,3994,81222.429999999993,0,0,0,0,0]
[322,"SUGAR-SALEM JOINT DISTRICT",58571670,826000836,25796,138618,40961,452957.61,0,7514.52,64531.900000000009]
[92,"SWAN VALLEY ELEMENTARY DISTRICT",803155381,826000681,8088,0,26868,0,217582.73,0,0]
[488,"SYRINGA MOUNTAIN SCHOOL, INC.",79390538,352450616,2226,20216,0,40027.78,0,0,0]
[461,"TAYLOR'S CROSSING PUBLIC CHARTER SCHOOL, INC.",797535601,202701493,11742,41234,20347,136346.83000000002,0,65703.400000000009,71526.999999999985]
[401,"TETON COUNTY DISTRICT",100599166,826000887,28318,205438,7705,820021,0,792144.82,199974]
[460,"THE ACADEMY, INC.",783840858,412193534,13574,0,0,0,0,0,0]
[470,"The Kootenai Bridge Academy, Inc.",831646554,263573121,0,0,0,0,0,0,0]
[494,"THE POCATELLO COMMUNITY CHARTER SCHOOL, INC.",113912443,820506158,10454.49,45386,0,227701,0,22188.670000000002,2085.2399999999998]
[475,"THE SAGE INTERNATIONAL SCHOOL OF BOISE, A PUBLIC CHARTER SCHOOL, INC.",32655155,270169469,18366,91518,0,107127.97,0,458091.01,144166.94]
[473,"THE VILLAGE CHARTER SCHOOL, INC.",968901947,270716284,11298,30941,0,168887,0,21746.639999999999,6013.6]
[559,"THOMAS JEFFERSON CHARTER SCHOOL, INC.",784840469,200508843,7499,17362,70267,103794,3024.25,0,0]
[416,"THREE CREEK JOINT ELEMENTARY DISTRICT",193613791,826001249,5783,0,6272,0,0,0,0]
[532,"TREASURE VALLEY CLASSICAL ACADEMY, INC.",81137699,814720145,0,21795.22,0,0,0,0,0]
[287,"TROY SCHOOL DISTRICT",824948165,820530483,2598,22082,0,98506.42,12671.35,92985.209999999992,16486.11]
[411,"TWIN FALLS DISTRICT",100015353,826000892,112051,1501280,0,5491644.71,0,330062.73,2377.13]
[486,"UPPER CARMEN PUBLIC CHARTER SCHOOL, INC.",186273954,760782276,2111,0,18841.52,0,48180.819999999992,0,0]
[262,"VALLEY DISTRICT",800469400,826001371,14203,69349,0,235257.04,0,0,0]
[139,"VALLIVUE SCHOOL DISTRICT",155896269,826001904,111184,1013646.9999999999,19687,851633,0,632171.61,221365.22000000003]
[451,"VICTORY CHARTER SCHOOL, INC.",195571505,562423033,12049,41448,47019,141975,31402,255194,25260.69]
[463,"VISION CHARTER SCHOOL, INC.",7896716,680609551,16002,59714,87923,213498.86,0,0,0]
[393,"WALLACE DISTRICT",47780739,826000886,13097,113840,0,199752.61,0,0,0]
[431,"WEISER DISTRICT",181914961,826000920,5098.4399999999996,228348,0,724597.40999999992,0,3249,34003.99]
[232,"WENDELL DISTRICT",100015379,826004158,15792,154561,0,665083,0,0,96700.98000000001]
[83,"WEST BONNER COUNTY DISTRICT",98834174,820508740,19027,315959.55,0,4818.83,0,0,116931.48999999999]
[253,"WEST JEFFERSON DISTRICT",122332075,820379941,14117,72030,31291,290083,0,0,0]
[202,"WEST SIDE JOINT DISTRICT",825388556,826000750,15829,58940,72061,138077,0,0,0]
[464,"WHITE PINE CHARTER SCHOOL, INC.",170300300,680502170,14661,37568,96146,164204,0,295151,73788]
[288,"WHITEPINE JOINT SCHOOL DISTRICT",37409539,820530482,10301,25660,21546,116568.75,0,22986.43,9582.08]
[133,"WILDER DISTRICT",29650553,826003336,13336,179260.97,0,422192.65,0,383553.70999999996,0]
[462,"XAVIER CHARTER SCHOOL, INC.",3514777,205009576,5023,53554,99659,86796.209999999992,0,13939.57,23156.19]
[]
[]
[4,"TEST LEA",101010,2020202020,0,0,0,0,0,0,11000]

{"sheet":"Remaining","index":11,"n_rows":185,"n_cols":31,"rows_kept":185,"cut":false,"hidden":false,"merged":[]}
[null,null,null,"awarded",null,null,null,null,null,null,"Expended",null,null,null,null,null,null,"Prior",null,null,null,null,null,null,"Remaining"]
["ID","Name","DUNS","CARES Set Aside (LMS and SEL)","CARES Flow Through","CRRSA Set Aside","CRRSA Flow Through","ARP Set Aside","ARP Flow Through","ARP Learning Loss","CARES Set Aside (LMS and SEL)","CARES Flow Through","CRRSA Set Aside","CRRSA Flow Through","ARP Set Aside","ARP Flow Through","ARP Learning Loss","CARES Set Aside (LMS and SEL)","CARES Flow Through","CRRSA Set Aside","CRRSA Flow Through","ARP Set Aside","ARP Flow Through","ARP Learning Loss","CARES Set Aside (LMS and SEL)","CARES Flow Through","CRRSA Set Aside","CRRSA Flow Through","ARP Set Aside","ARP Flow Through","ARP Learning Loss"]
[58,"ABERDEEN DISTRICT",801867284,{"$f":"IFERROR(VLOOKUP($A3,Awarded!$A$2:$J$196,4,FALSE),0)","v":16019.45},{"$f":"IFERROR(VLOOKUP($A3,Awarded!$A$2:$J$196,5,FALSE),0)","v":133884.35},{"$f":"IFERROR(VLOOKUP($A3,Awarded!$A$2:$J$196,6,FALSE),0)","v":0},{"$f":"IFERROR(VLOOKUP($A3,Awarded!$A$2:$J$196,7,FALSE),0)","v":503927.13},{"$f":"IFERROR(VLOOKUP($A3,Awarded!$A$2:$J$196,8,FALSE),0)","v":0},{"$f":"IFERROR(VLOOKUP($A3,Awarded!$A$2:$J$196,9,FALSE),0)","v":904805.38},{"$f":"IFERROR(VLOOKUP($A3,Awarded!$A$2:$J$196,10,FALSE),0)","v":226021.35},{"$f":"IFERROR(VLOOKUP($A3,Expended!$A$2:$J$198,5,FALSE),0)","v":8794.4500000000007},{"$f":"IFERROR(VLOOKUP($A3,Expended!$A$2:$J$198,6,FALSE),0)","v":137.35},{"$f":"IFERROR(VLOOKUP($A3,Expended!$A$2:$J$198,7,FALSE),0)","v":0},{"$f":"IFERROR(VLOOKUP($A3,Expended!$A$2:$J$198,8,FALSE),0)","v":165547.34},{"$f":"IFERROR(VLOOKUP($A3,Expended!$A$2:$J$198,9,FALSE),0)","v":0},{"$f":"IFERROR(VLOOKUP($A3,Expended!$A$2:$J$198,10,FALSE),0)","v":425263.63999999996},{"$f":"IFERROR(VLOOKUP($A3,Expended!$A$2:$L$198,11,FALSE),0)","v":116536.58},{"$f":"VLOOKUP($A3,Prior!$A$1:$K$199,5,FALSE)","v":7225},{"$f":"VLOOKUP($A3,Prior!$A$1:$K$199,6,FALSE)","v":133747},{"$f":"VLOOKUP($A3,Prior!$A$1:$K$199,7,FALSE)","v":0},{"$f":"VLOOKUP($A3,Prior!$A$1:$K$199,8,FALSE)","v":338379.79},{"$f":"VLOOKUP($A3,Prior!$A$1:$K$199,9,FALSE)","v":0},{"$f":"VLOOKUP($A3,Prior!$A$1:$K$199,10,FALSE)","v":479541.74},{"$f":"VLOOKUP($A3,Prior!$A$1:$K$199,11,FALSE)","v":86565.35},{"$f":"D3-K3-R3","v":0},{"$f":"E3-L3-S3","v":0},{"$f":"F3-M3-T3","v":0},{"$f":"G3-N3-U3","v":0},{"$f":"H3-O3-V3","v":0},{"$f":"I3-P3-W3","v":0},{"$f":"J3-Q3-X3","v":22919.42}]
[495,"ALTURAS INTERNATIONAL ACADEMY, INC.",71549639,{"$f":"IFERROR(VLOOKUP($A4,Awarded!$A$2:$J$196,4,FALSE),0)","v":14265.400000000001},{"$f":"IFERROR(VLOOKUP($A4,Awarded!$A$2:$J$196,5,FALSE),0)","v":52913.279999999999},{"$f":"IFERROR(VLOOKUP($A4,Awarded!$A$2:$J$196,6,FALSE),0)","v":30309.96},{"$f":"IFERROR(VLOOKUP($A4,Awarded!$A$2:$J$196,7,FALSE),0)","v":234551.48},{"$f":"IFERROR(VLOOKUP($A4,Awarded!$A$2:$J$196,8,FALSE),0)","v":0},{"$f":"IFERROR(VLOOKUP($A4,Awarded!$A$2:$J$196,9,FALSE),0)","v":421138.97},{"$f":"IFERROR(VLOOKUP($A4,Awarded!$A$2:$J$196,10,FALSE),0)","v":105201.33},{"$f":"IFERROR(VLOOKUP($A4,Expended!$A$2:$J$198,5,FALSE),0)","v":11122.400000000001},{"$f":"IFERROR(VLOOKUP($A4,Expended!$A$2:$J$198,6,FALSE),0)","v":54.28},{"$f":"IFERROR(VLOOKUP($A4,Expended!$A$2:$J$198,7,FALSE),0)","v":30309.96},{"$f":"IFERROR(VLOOKUP($A4,Expended!$A$2:$J$198,8,FALSE),0)","v":53349.9},{"$f":"IFERROR(VLOOKUP($A4,Expended!$A$2:$J$198,9,FALSE),0)","v":0},{"$f":"IFERROR(VLOOKUP($A4,Expended!$A$2:$J$198,10,FALSE),0)","v":378989.38},{"$f":"IFERROR(VLOOKUP($A4,Expended!$A$2:$L$198,11,FALSE),0)","v":10251.9},{"$f":"VLOOKUP($A4,Prior!$A$1:$K$199,5,FALSE)","v":3143},{"$f":"VLOOKUP($A4,Prior!$A$1:$K$199,6,FALSE)","v":52859},{"$f":"VLOOKUP($A4,Prior!$A$1:$K$199,7,FALSE)","v":0},{"$f":"VLOOKUP($A4,Prior!$A$1:$K$199,8,FALSE)","v":181201.58000000002},{"$f":"VLOOKUP($A4,Prior!$A$1:$K$199,9,FALSE)","v":0},{"$f":"VLOOKUP($A4,Prior!$A$1:$K$199,10,FALSE)","v":0},{"$f":"VLOOKUP($A4,Prior!$A$1:$K$199,11,FALSE)","v":0},0,0,0,0,0,42149.589999999967,94949.430000000008]
[560,"ALTURAS PREPARATORY ACADEMY, INC",36487482,{"$f":"IFERROR(VLOOKUP($A5,Awarded!$A$2:$J$196,4,FALSE),0)","v":0},{"$f":"IFERROR(VLOOKUP($A5,Awarded!$A$2:$J$196,5,FALSE),0)","v":0},{"$f":"IFERROR(VLOOKUP($A5,Awarded!$A$2:$J$196,6,FALSE),0)","v":0},{"$f":"IFERROR(VLOOKUP($A5,Awarded!$A$2:$J$196,7,FALSE),0)","v":96571.77},{"$f":"IFERROR(VLOOKUP($A5,Awarded!$A$2:$J$196,8,FALSE),0)","v":115011},{"$f":"IFERROR(VLOOKUP($A5,Awarded!$A$2:$J$196,9,FALSE),0)","v":173395.91},{"$f":"IFERROR(VLOOKUP($A5,Awarded!$A$2:$J$196,10,FALSE),0)","v":43314.78},{"$f":"IFERROR(VLOOKUP($A5,Expended!$A$2:$J$198,5,FALSE),0)","v":0},{"$f":"IFERROR(VLOOKUP($A5,Expended!$A$2:$J$198,6,FALSE),0)","v":0},{"$f":"IFERROR(VLOOKUP($A5,Expended!$A$2:$J$198,7,FALSE),0)","v":0},{"$f":"IFERROR(VLOOKUP($A5,Expended!$A$2:$J$198,8,FALSE),0)","v":216.77},{"$f":"IFERROR(VLOOKUP($A5,Expended!$A$2:$J$198,9,FALSE),0)","v":0},{"$f":"IFERROR(VLOOKUP($A5,Expended!$A$2:$J$198,10,FALSE),0)","v":104017.26999999999},{"$f":"IFERROR(VLOOKUP($A5,Expended!$A$2:$L$198,11,FALSE),0)","v":13823.36},{"$f":"VLOOKUP($A5,Prior!$A$1:$K$199,5,FALSE)","v":0},{"$f":"VLOOKUP($A5,Prior!$A$1:$K$199,6,FALSE)","v":0},{"$f":"VLOOKUP($A5,Prior!$A$1:$K$199,7,FALSE)","v":0},{"$f":"VLOOKUP($A5,Prior!$A$1:$K$199,8,FALSE)","v":96355},{"$f":"VLOOKUP($A5,Prior!$A$1:$K$199,9,FALSE)","v":0},{"$f":"VLOOKUP($A5,Prior!$A$1:$K$199,10,FALSE)","v":41530.120000000003},{"$f":"VLOOKUP($A5,Prior!$A$1:$K$199,11,FALSE)","v":4566.45},0,0,0,0,115011,27848.520000000011,24924.969999999998]
[381,"AMERICAN FALLS JOINT DISTRICT",144756442,{"$f":"IFERROR(VLOOKUP($A6,Awarded!$A$2:$J$196,4,FALSE),0)","v":27962.95},{"$f":"IFERROR(VLOOKUP($A6,Awarded!$A$2:$J$196,5,FALSE),0)","v":295973.63},{"$f":"IFERROR(VLOOKUP($A6,Awarded!$A$2:$J$196,6,FALSE),0)","v":0},{"$f":"IFERROR(VLOOKUP($A6,Awarded!$A$2:$J$196,7,FALSE),0)","v":1182846.05},{"$f":"IFERROR(VLOOKUP($A6,Awarded!$A$2:$J$196,8,FALSE),0)","v":0},{"$f":"IFERROR(VLOOKUP($A6,Awarded!$A$2:$J$196,9,FALSE),0)","v":2123808.8199999998},{"$f":"IFERROR(VLOOKUP($A6,Awarded!$A$2:$J$196,10,FALSE),0)","v":530530.30000000005},{"$f":"IFERROR(VLOOKUP($A6,Expended!$A$2:$J$198,5,FALSE),0)","v":7315.83},{"$f":"IFERROR(VLOOKUP($A6,Expended!$A$2:$J$198,6,FALSE),0)","v":303.63},{"$f":"IFERROR(VLOOKUP($A6,Expended!$A$2:$J$198,7,FALSE),0)","v":0},{"$f":"IFERROR(VLOOKUP($A6,Expended!$A$2:$J$198,8,FALSE),0)","v":100309.73999999999},{"$f":"IFERROR(VLOOKUP($A6,Expended!$A$2:$J$198,9,FALSE),0)","v":0},{"$f":"IFERROR(VLOOKUP($A6,Expended!$A$2:$J$198,10,FALSE),0)","v":1016601.29},{"$f":"IFERROR(VLOOKUP($A6,Expended!$A$2:$L$198,11,FALSE),0)","v":108940.11},{"$f":"VLOOKUP($A6,Prior!$A$1:$K$199,5,FALSE)","v":20647.12},{"$f":"VLOOKUP($A6,Prior!$A$1:$K$199,6,FALSE)","v":295670},{"$f":"VLOOKUP($A6,Prior!$A$1:$K$199,7,FALSE)","v":0},{"$f":"VLOOKUP($A6,Prior!$A$1:$K$199,8,FALSE)","v":1082536.31},{"$f":"VLOOKUP($A6,Prior!$A$1:$K$199,9,FALSE)","v":0},{"$f":"VLOOKUP($A6,Prior!$A$1:$K$199,10,FALSE)","v":705325.07000000007},{"$f":"VLOOKUP($A6,Prior!$A$1:$K$199,11,FALSE)","v":203355.12},0,0,0,0,0,401882.45999999973,218235.07000000007]
[482,"AMERICAN HERITAGE CHARTER SCHOOL, INC.",79082049,{"$f":"IFERROR(VLOOKUP($A7,Awarded!$A$2:$J$196,4,FALSE),0)","v":12476.080000000002},{"$f":"IFERROR(VLOOKUP($A7,Awarded!$A$2:$J$196,5,FALSE),0)","v":24524.16},{"$f":"IFERROR(VLOOKUP($A7,Awarded!$A$2:$J$196,6,FALSE),0)","v":60969.05},{"$f":"IFERROR(VLOOKUP($A7,Awarded!$A$2:$J$196,7,FALSE),0)","v":132273.91},{"$f":"IFERROR(VLOOKUP($A7,Awarded!$A$2:$J$196,8,FALSE),0)","v":53776},{"$f":"IFERROR(VLOOKUP($A7,Awarded!$A$2:$J$196,9,FALSE),0)","v":237499.19},{"$f":"IFERROR(VLOOKUP($A7,Awarded!$A$2:$J$196,10,FALSE),0)","v":59327.62},{"$f":"IFERROR(VLOOKUP($A7,Expended!$A$2:$J$198,5,FALSE),0)","v":441.08000000000004},{"$f":"IFERROR(VLOOKUP($A7,Expended!$A$2:$J$198,6,FALSE),0)","v":52.04},{"$f":"IFERROR(VLOOKUP($A7,Expended!$A$2:$J$198,7,FALSE),0)","v":60969.05},{"$f":"IFERROR(VLOOKUP($A7,Expended!$A$2:$J$198,8,FALSE),0)","v":100844.2},{"$f":"IFERROR(VLOOKUP($A7,Expended!$A$2:$J$198,9,FALSE),0)","v":53776},{"$f":"IFERROR(VLOOKUP($A7,Expended!$A$2:$J$198,10,FALSE),0)","v":237499.19},{"$f":"IFERROR(VLOOKUP($A7,Expended!$A$2:$L$198,11,FALSE),0)","v":29736.760000000002},{"$f":"VLOOKUP($A7,Prior!$A$1:$K$199,5,FALSE)","v":12035},{"$f":"VLOOKUP($A7,Prior!$A$1:$K$199,6,FALSE)","v":24472.12},{"$f":"VLOOKUP($A7,Prior!$A$1:$K$199,7,FALSE)","v":0},{"$f":"VLOOKUP($A7,Prior!$A$1:$K$199,8,FALSE)","v":31429.71},{"$f":"VLOOKUP($A7,Prior!$A$1:$K$199,9,FALSE)","v":0},{"$f":"VLOOKUP($A7,Prior!$A$1:$K$199,10,FALSE)","v":0},{"$f":"VLOOKUP($A7,Prior!$A$1:$K$199,11,FALSE)","v":0},0,0,0,0,0,0,29590.86]
[492,"ANSER OF IDAHO, INC.",832063890,{"$f":"IFERROR(VLOOKUP($A8,Awarded!$A$2:$J$196,4,FALSE),0)","v":0},{"$f":"IFERROR(VLOOKUP($A8,Awarded!$A$2:$J$196,5,FALSE),0)","v":19499},{"$f":"IFERROR(VLOOKUP($A8,Awarded!$A$2:$J$196,6,FALSE),0)","v":54211.839999999997},{"$f":"IFERROR(VLOOKUP($A8,Awarded!$A$2:$J$196,7,FALSE),0)","v":145509.62},{"$f":"IFERROR(VLOOKUP($A8,Awarded!$A$2:$J$196,8,FALSE),0)","v":24223},{"$f":"IFERROR(VLOOKUP($A8,Awarded!$A$2:$J$196,9,FALSE),0)","v":261262.72},{"$f":"IFERROR(VLOOKUP($A8,Awarded!$A$2:$J$196,10,FALSE),0)","v":65263.78},{"$f":"IFERROR(VLOOKUP($A8,Expended!$A$2:$J$198,5,FALSE),0)","v":0},{"$f":"IFERROR(VLOOKUP($A8,Expended!$A$2:$J$198,6,FALSE),0)","v":0},{"$f":"IFERROR(VLOOKUP($A8,Expended!$A$2:$J$198,7,FALSE),0)","v":43659.21},{"$f":"IFERROR(VLOOKUP($A8,Expended!$A$2:$J$198,8,FALSE),0)","v":15468.32},{"$f":"IFERROR(VLOOKUP($A8,Expended!$A$2:$J$198,9,FALSE),0)","v":6737.55},{"$f":"IFERROR(VLOOKUP($A8,Expended!$A$2:$J$198,10,FALSE),0)","v":33025.94},{"$f":"IFERROR(VLOOKUP($A8,Expended!$A$2:$L$198,11,FALSE),0)","v":0},{"$f":"VLOOKUP($A8,Prior!$A$1:$K$199,5,FALSE)","v":0},{"$f":"VLOOKUP($A8,Prior!$A$1:$K$199,6,FALSE)","v":19479},{"$f":"VLOOKUP($A8,Prior!$A$1:$K$199,7,FALSE)","v":0},{"$f":"VLOOKUP($A8,Prior!$A$1:$K$199,8,FALSE)","v":128805.88},{"$f":"VLOOKUP($A8,Prior!$A$1:$K$199,9,FALSE)","v":0},{"$f":"VLOOKUP($A8,Prior!$A$1:$K$199,10,FALSE)","v":0},{"$f":"VLOOKUP($A8,Prior!$A$1:$K$199,11,FALSE)","v":65126.95},0,20,10552.629999999997,1235.4199999999837,17485.45,228236.78,136.83000000000175]
[383,"ARBON ELEMENTARY DISTRICT",189339153,{"$f":"IFERROR(VLOOKUP($A9,Awarded!$A$2:$J$196,4,FALSE),0)","v":8190.1900000000005},{"$f":"IFERROR(VLOOKUP($A9,Awarded!$A$2:$J$196,5,FALSE),0)","v":0},{"$f":"IFERROR(VLOOKUP($A9,Awarded!$A$2:$J$196,6,FALSE),0)","v":8579.48},{"$f":"IFERROR(VLOOKUP($A9,Awarded!$A$2:$J$196,7,FALSE),0)","v":0},{"$f":"IFERROR(VLOOKUP($A9,Awarded!$A$2:$J$196,8,FALSE),0)","v":349143},{"$f":"IFERROR(VLOOKUP($A9,Awarded!$A$2:$J$196,9,FALSE),0)","v":0},{"$f":"IFERROR(VLOOKUP($A9,Awarded!$A$2:$J$196,10,FALSE),0)","v":0},{"$f":"IFERROR(VLOOKUP($A9,Expended!$A$2:$J$198,5,FALSE),0)","v":4032.19},{"$f":"IFERROR(VLOOKUP($A9,Expended!$A$2:$J$198,6,FALSE),0)","v":0},{"$f":"IFERROR(VLOOKUP($A9,Expended!$A$2:$J$198,7,FALSE),0)","v":332.34000000000003},{"$f":"IFERROR(VLOOKUP($A9,Expended!$A$2:$J$198,8,FALSE),0)","v":0},{"$f":"IFERROR(VLOOKUP($A9,Expended!$A$2:$J$198,9,FALSE),0)","v":94267.35},{"$f":"IFERROR(VLOOKUP($A9,Expended!$A$2:$J$198,10,FALSE),0)","v":0},{"$f":"IFERROR(VLOOKUP($A9,Expended!$A$2:$L$198,11,FALSE),0)","v":0},{"$f":"VLOOKUP($A9,Prior!$A$1:$K$199,5,FALSE)","v":4158},{"$f":"VLOOKUP($A9,Prior!$A$1:$K$199,6,FALSE)","v":0},{"$f":"VLOOKUP($A9,Prior!$A$1:$K$199,7,FALSE)","v":761.22},{"$f":"VLOOKUP($A9,Prior!$A$1:$K$199,8,FALSE)","v":0},{"$f":"VLOOKUP($A9,Prior!$A$1:$K$199,9,FALSE)","v":0},{"$f":"VLOOKUP($A9,Prior!$A$1:$K$199,10,FALSE)","v":0},{"$f":"VLOOKUP($A9,Prior!$A$1:$K$199,11,FALSE)","v":0},0,0,7485.9199999999992,0,254875.65,0,0]
[394,"AVERY SCHOOL DISTRICT",100599109,{"$f":"IFERROR(VLOOKUP($A10,Awarded!$A$2:$J$196,4,FALSE),0)","v":8289.93},{"$f":"IFERROR(VLOOKUP($A10,Awarded!$A$2:$J$196,5,FALSE),0)","v":0},{"$f":"IFERROR(VLOOKUP($A10,Awarded!$A$2:$J$196,6,FALSE),0)","v":11056.14},{"$f":"IFERROR(VLOOKUP($A10,Awarded!$A$2:$J$196,7,FALSE),0)","v":0},{"$f":"IFERROR(VLOOKUP($A10,Awarded!$A$2:$J$196,8,FALSE),0)","v":349143},{"$f":"IFERROR(VLOOKUP($A10,Awarded!$A$2:$J$196,9,FALSE),0)","v":0},{"$f":"IFERROR(VLOOKUP($A10,Awarded!$A$2:$J$196,10,FALSE),0)","v":0},{"$f":"IFERROR(VLOOKUP($A10,Expended!$A$2:$J$198,5,FALSE),0)","v":330.93},{"$f":"IFERROR(VLOOKUP($A10,Expended!$A$2:$J$198,6,FALSE),0)","v":0},{"$f":"IFERROR(VLOOKUP($A10,Expended!$A$2:$J$198,7,FALSE),0)","v":11056.14},{"$f":"IFERROR(VLOOKUP($A10,Expended!$A$2:$J$198,8,FALSE),0)","v":0},{"$f":"IFERROR(VLOOKUP($A10,Expended!$A$2:$J$198,9,FALSE),0)","v":272860.86},{"$f":"IFERROR(VLOOKUP($A10,Expended!$A$2:$J$198,10,FALSE),0)","v":0},{"$f":"IFERROR(VLOOKUP($A10,Expended!$A$2:$L$198,11,FALSE),0)","v":0},{"$f":"VLOOKUP($A10,Prior!$A$1:$K$199,5,FALSE)","v":7959},{"$f":"VLOOKUP($A10,Prior!$A$1:$K$199,6,FALSE)","v":0},{"$f":"VLOOKUP($A10,Prior!$A$1:$K$199,7,FALSE)","v":0},{"$f":"VLOOKUP($A10,Prior!$A$1:$K$199,8,FALSE)","v":0},{"$f":"VLOOKUP($A10,Prior!$A$1:$K$199,9,FALSE)","v":76282.14},{"$f":"VLOOKUP($A10,Prior!$A$1:$K$199,10,FALSE)","v":0},{"$f":"VLOOKUP($A10,Prior!$A$1:$K$199,11,FALSE)","v":0},0,0,0,0,0,0,0]
[72,"BASIN SCHOOL DISTRICT",100014778,{"$f":"IFERROR(VLOOKUP($A11,Awarded!$A$2:$J$196,4,FALSE),0)","v":11634},{"$f":"IFERROR(VLOOKUP($A11,Awarded!$A$2:$J$196,5,FALSE),0)","v":38320.31},{"$f":"IFERROR(VLOOKUP($A11,Awarded!$A$2:$J$196,6,FALSE),0)","v":0},{"$f":"IFERROR(VLOOKUP($A11,Awarded!$A$2:$J$196,7,FALSE),0)","v":213795.89},{"$f":"IFERROR(VLOOKUP($A11,Awarded!$A$2:$J$196,8,FALSE),0)","v":0},{"$f":"IFERROR(VLOOKUP($A11,Awarded!$A$2:$J$196,9,FALSE),0)","v":383871.79},{"$f":"IFERROR(VLOOKUP($A11,Awarded!$A$2:$J$196,10,FALSE),0)","v":95891.94},{"$f":"IFERROR(VLOOKUP($A11,Expended!$A$2:$J$198,5,FALSE),0)","v":0},{"$f":"IFERROR(VLOOKUP($A11,Expended!$A$2:$J$198,6,FALSE),0)","v":39.31},{"$f":"IFERROR(VLOOKUP($A11,Expended!$A$2:$J$198,7,FALSE),0)","v":0},{"$f":"IFERROR(VLOOKUP($A11,Expended!$A$2:$J$198,8,FALSE),0)","v":479.89},{"$f":"IFERROR(VLOOKUP($A11,Expended!$A$2:$J$198,9,FALSE),0)","v":0},{"$f":"IFERROR(VLOOKUP($A11,Expended!$A$2:$J$198,10,FALSE),0)","v":125435.09},{"$f":"IFERROR(VLOOKUP($A11,Expended!$A$2:$L$198,11,FALSE),0)","v":34.94},{"$f":"VLOOKUP($A11,Prior!$A$1:$K$199,5,FALSE)","v":11634},{"$f":"VLOOKUP($A11,Prior!$A$1:$K$199,6,FALSE)","v":38281},{"$f":"VLOOKUP($A11,Prior!$A$1:$K$199,7,FALSE)","v":0},{"$f":"VLOOKUP($A11,Prior!$A$1:$K$199,8,FALSE)","v":213315.80000000002},{"$f":"VLOOKUP($A11,Prior!$A$1:$K$199,9,FALSE)","v":0},{"$f":"VLOOKUP($A11,Prior!$A$1:$K$199,10,FALSE)","v":186675.32},{"$f":"VLOOKUP($A11,Prior!$A$1:$K$199,11,FALSE)","v":95857},0,0,0,0.1999999999825377,0,71761.379999999976,0]
[33,"BEAR LAKE COUNTY DISTRICT",183893577,{"$f":"IFERROR(VLOOKUP($A12,Awarded!$A$2:$J$196,4,FALSE),0)","v":23689},{"$f":"IFERROR(VLOOKUP($A12,Awarded!$A$2:$J$196,5,FALSE),0)","v":148980.82999999999},{"$f":"IFERROR(VLOOKUP($A12,Awarded!$A$2:$J$196,6,FALSE),0)","v":17582.63},{"$f":"IFERROR(VLOOKUP($A12,Awarded!$A$2:$J$196,7,FALSE),0)","v":595396.44999999995},{"$f":"IFERROR(VLOOKUP($A12,Awarded!$A$2:$J$196,8,FALSE),0)","v":0},{"$f":"IFERROR(VLOOKUP($A12,Awarded!$A$2:$J$196,9,FALSE),0)","v":1069038.68},{"$f":"IFERROR(VLOOKUP($A12,Awarded!$A$2:$J$196,10,FALSE),0)","v":267047.3},{"$f":"IFERROR(VLOOKUP($A12,Expended!$A$2:$J$198,5,FALSE),0)","v":2606},{"$f":"IFERROR(VLOOKUP($A12,Expended!$A$2:$J$198,6,FALSE),0)","v":152.83000000000001},{"$f":"IFERROR(VLOOKUP($A12,Expended!$A$2:$J$198,7,FALSE),0)","v":0},{"$f":"IFERROR(VLOOKUP($A12,Expended!$A$2:$J$198,8,FALSE),0)","v":1336.45},{"$f":"IFERROR(VLOOKUP($A12,Expended!$A$2:$J$198,9,FALSE),0)","v":0},{"$f":"IFERROR(VLOOKUP($A12,Expended!$A$2:$J$198,10,FALSE),0)","v":383037.43},{"$f":"IFERROR(VLOOKUP($A12,Expended!$A$2:$L$198,11,FALSE),0)","v":76910.69},{"$f":"VLOOKUP($A12,Prior!$A$1:$K$199,5,FALSE)","v":21083},{"$f":"VLOOKUP($A12,Prior!$A$1:$K$199,6,FALSE)","v":148828},{"$f":"VLOOKUP($A12,Prior!$A$1:$K$199,7,FALSE)","v":17223},{"$f":"VLOOKUP($A12,Prior!$A$1:$K$199,8,FALSE)","v":594060},{"$f":"VLOOKUP($A12,Prior!$A$1:$K$199,9,FALSE)","v":0},{"$f":"VLOOKUP($A12,Prior!$A$1:$K$199,10,FALSE)","v":0},{"$f":"VLOOKUP($A12,Prior!$A$1:$K$199,11,FALSE)","v":0},0,0,359.63000000000102,0,0,686001.25,190136.61]
[477,"BLACKFOOT CHARTER COMMUNITY LEARNING CENTER, INC.",142291967,{"$f":"IFERROR(VLOOKUP($A13,Awarded!$A$2:$J$196,4,FALSE),0)","v":14317.04},{"$f":"IFERROR(VLOOKUP($A13,Awarded!$A$2:$J$196,5,FALSE),0)","v":83477.64},{"$f":"IFERROR(VLOOKUP($A13,Awarded!$A$2:$J$196,6,FALSE),0)","v":0},{"$f":"IFERROR(VLOOKUP($A13,Awarded!$A$2:$J$196,7,FALSE),0)","v":428192.13},{"$f":"IFERROR(VLOOKUP($A13,Awarded!$A$2:$J$196,8,FALSE),0)","v":0},{"$f":"IFERROR(VLOOKUP($A13,Awarded!$A$2:$J$196,9,FALSE),0)","v":768822.82},{"$f":"IFERROR(VLOOKUP($A13,Awarded!$A$2:$J$196,10,FALSE),0)","v":192052.98},{"$f":"IFERROR(VLOOKUP($A13,Expended!$A$2:$J$198,5,FALSE),0)","v":8681.19},{"$f":"IFERROR(VLOOKUP($A13,Expended!$A$2:$J$198,6,FALSE),0)","v":85.64},{"$f":"IFERROR(VLOOKUP($A13,Expended!$A$2:$J$198,7,FALSE),0)","v":0},{"$f":"IFERROR(VLOOKUP($A13,Expended!$A$2:$J$198,8,FALSE),0)","v":161974.37},{"$f":"IFERROR(VLOOKUP($A13,Expended!$A$2:$J$198,9,FALSE),0)","v":0},{"$f":"IFERROR(VLOOKUP($A13,Expended!$A$2:$J$198,10,FALSE),0)","v":437823.64},{"$f":"IFERROR(VLOOKUP($A13,Expended!$A$2:$L$198,11,FALSE),0)","v":88925.97},{"$f":"VLOOKUP($A13,Prior!$A$1:$K$199,5,FALSE)","v":5635.85},{"$f":"VLOOKUP($A13,Prior!$A$1:$K$199,6,FALSE)","v":83392},{"$f":"VLOOKUP($A13,Prior!$A$1:$K$199,7,FALSE)","v":0},{"$f":"VLOOKUP($A13,Prior!$A$1:$K$199,8,FALSE)","v":266217.76},{"$f":"VLOOKUP($A13,Prior!$A$1:$K$199,9,FALSE)","v":0},{"$f":"VLOOKUP($A13,Prior!$A$1:$K$199,10,FALSE)","v":0},{"$f":"VLOOKUP($A13,Prior!$A$1:$K$199,11,FALSE)","v":103127.01},0,0,0,0,0,330999.17999999993,0]
[55,"BLACKFOOT DISTRICT",607630415,{"$f":"IFERROR(VLOOKUP($A14,Awarded!$A$2:$J$196,4,FALSE),0)","v":50921.19},{"$f":"IFERROR(VLOOKUP($A14,Awarded!$A$2:$J$196,5,FALSE),0)","v":470701.87},{"$f":"IFERROR(VLOOKUP($A14,Awarded!$A$2:$J$196,6,FALSE),0)","v":0},{"$f":"IFERROR(VLOOKUP($A14,Awarded!$A$2:$J$196,7,FALSE),0)","v":2297152.2599999998},{"$f":"IFERROR(VLOOKUP($A14,Awarded!$A$2:$J$196,8,FALSE),0)","v":0},{"$f":"IFERROR(VLOOKUP($A14,Awarded!$A$2:$J$196,9,FALSE),0)","v":4124554.04},{"$f":"IFERROR(VLOOKUP($A14,Awarded!$A$2:$J$196,10,FALSE),0)","v":1030319.4},{"$f":"IFERROR(VLOOKUP($A14,Expended!$A$2:$J$198,5,FALSE),0)","v":9942.33},{"$f":"IFERROR(VLOOKUP($A14,Expended!$A$2:$J$198,6,FALSE),0)","v":0},{"$f":"IFERROR(VLOOKUP($A14,Expended!$A$2:$J$198,7,FALSE),0)","v":0},{"$f":"IFERROR(VLOOKUP($A14,Expended!$A$2:$J$198,8,FALSE),0)","v":30581.18},{"$f":"IFERROR(VLOOKUP($A14,Expended!$A$2:$J$198,9,FALSE),0)","v":0},{"$f":"IFERROR(VLOOKUP($A14,Expended!$A$2:$J$198,10,FALSE),0)","v":2452363.66},{"$f":"IFERROR(VLOOKUP($A14,Expended!$A$2:$L$198,11,FALSE),0)","v":259417.58},{"$f":"VLOOKUP($A14,Prior!$A$1:$K$199,5,FALSE)","v":25888.82},{"$f":"VLOOKUP($A14,Prior!$A$1:$K$199,6,FALSE)","v":470219},{"$f":"VLOOKUP($A14,Prior!$A$1:$K$199,7,FALSE)","v":0},{"$f":"VLOOKUP($A14,Prior!$A$1:$K$199,8,FALSE)","v":2260354.08},{"$f":"VLOOKUP($A14,Prior!$A$1:$K$199,9,FALSE)","v":0},{"$f":"VLOOKUP($A14,Prior!$A$1:$K$199,10,FALSE)","v":1521400.88},{"$f":"VLOOKUP($A14,Prior!$A$1:$K$199,11,FALSE)","v":770526.42},15090.04,482.86999999999534,0,6216.9999999995343,0,150789.5,375.40000000002328]
[61,"BLAINE COUNTY DISTRICT",794328906,{"$f":"IFERROR(VLOOKUP($A15,Awarded!$A$2:$J$196,4,FALSE),0)","v":46172.85},{"$f":"IFERROR(VLOOKUP($A15,Awarded!$A$2:$J$196,5,FALSE),0)","v":239900.1},{"$f":"IFERROR(VLOOKUP($A15,Awarded!$A$2:$J$196,6,FALSE),0)","v":339156.05},{"$f":"IFERROR(VLOOKUP($A15,Awarded!$A$2:$J$196,7,FALSE),0)","v":928892.02},{"$f":"IFERROR(VLOOKUP($A15,Awarded!$A$2:$J$196,8,FALSE),0)","v":0},{"$f":"IFERROR(VLOOKUP($A15,Awarded!$A$2:$J$196,9,FALSE),0)","v":1667832.49},{"$f":"IFERROR(VLOOKUP($A15,Awarded!$A$2:$J$196,10,FALSE),0)","v":416626.8},{"$f":"IFERROR(VLOOKUP($A15,Expended!$A$2:$J$198,5,FALSE),0)","v":12881.17},{"$f":"IFERROR(VLOOKUP($A15,Expended!$A$2:$J$198,6,FALSE),0)","v":246.1},{"$f":"IFERROR(VLOOKUP($A15,Expended!$A$2:$J$198,7,FALSE),0)","v":236325.68},{"$f":"IFERROR(VLOOKUP($A15,Expended!$A$2:$J$198,8,FALSE),0)","v":800449.05},{"$f":"IFERROR(VLOOKUP($A15,Expended!$A$2:$J$198,9,FALSE),0)","v":0},{"$f":"IFERROR(VLOOKUP($A15,Expended!$A$2:$J$198,10,FALSE),0)","v":561398.09},{"$f":"IFERROR(VLOOKUP($A15,Expended!$A$2:$L$198,11,FALSE),0)","v":6807},{"$f":"VLOOKUP($A15,Prior!$A$1:$K$199,5,FALSE)","v":32610.15},{"$f":"VLOOKUP($A15,Prior!$A$1:$K$199,6,FALSE)","v":239654},{"$f":"VLOOKUP($A15,Prior!$A$1:$K$199,7,FALSE)","v":0},{"$f":"VLOOKUP($A15,Prior!$A$1:$K$199,8,FALSE)","v":0},{"$f":"VLOOKUP($A15,Prior!$A$1:$K$199,9,FALSE)","v":0},{"$f":"VLOOKUP($A15,Prior!$A$1:$K$199,10,FALSE)","v":0},{"$f":"VLOOKUP($A15,Prior!$A$1:$K$199,11,FALSE)","v":0},681.52999999999884,0,102830.37,128442.96999999997,0,1106434.3999999999,409819.8]
[234,"BLISS JOINT DISTRICT",40197688,{"$f":"IFERROR(VLOOKUP($A16,Awarded!$A$2:$J$196,4,FALSE),0)","v":2307.9499999999998},{"$f":"IFERROR(VLOOKUP($A16,Awarded!$A$2:$J$196,5,FALSE),0)","v":28873.62},{"$f":"IFERROR(VLOOKUP($A16,Awarded!$A$2:$J$196,6,FALSE),0)","v":5462.73},{"$f":"IFERROR(VLOOKUP($A16,Awarded!$A$2:$J$196,7,FALSE),0)","v":105941.8},{"$f":"IFERROR(VLOOKUP($A16,Awarded!$A$2:$J$196,8,FALSE),0)","v":112575},{"$f":"IFERROR(VLOOKUP($A16,Awarded!$A$2:$J$196,9,FALSE),0)","v":190220.4},{"$f":"IFERROR(VLOOKUP($A16,Awarded!$A$2:$J$196,10,FALSE),0)","v":47517.31},{"$f":"IFERROR(VLOOKUP($A16,Expended!$A$2:$J$198,5,FALSE),0)","v":0},{"$f":"IFERROR(VLOOKUP($A16,Expended!$A$2:$J$198,6,FALSE),0)","v":0},{"$f":"IFERROR(VLOOKUP($A16,Expended!$A$2:$J$198,7,FALSE),0)","v":0},{"$f":"IFERROR(VLOOKUP($A16,Expended!$A$2:$J$198,8,FALSE),0)","v":21740},{"$f":"IFERROR(VLOOKUP($A16,Expended!$A$2:$J$198,9,FALSE),0)","v":0},{"$f":"IFERROR(VLOOKUP($A16,Expended!$A$2:$J$198,10,FALSE),0)","v":82421.100000000006},{"$f":"IFERROR(VLOOKUP($A16,Expended!$A$2:$L$198,11,FALSE),0)","v":18920.97},{"$f":"VLOOKUP($A16,Prior!$A$1:$K$199,5,FALSE)","v":688.22000000000014},{"$f":"VLOOKUP($A16,Prior!$A$1:$K$199,6,FALSE)","v":28844},{"$f":"VLOOKUP($A16,Prior!$A$1:$K$199,7,FALSE)","v":1119.6300000000001},{"$f":"VLOOKUP($A16,Prior!$A$1:$K$199,8,FALSE)","v":75163.320000000007},{"$f":"VLOOKUP($A16,Prior!$A$1:$K$199,9,FALSE)","v":106503.17},{"$f":"VLOOKUP($A16,Prior!$A$1:$K$199,10,FALSE)","v":0},{"$f":"VLOOKUP($A16,Prior!$A$1:$K$199,11,FALSE)","v":21437.850000000002},1619.7299999999996,29.619999999998981,4343.0999999999995,9038.4799999999959,6071.8300000000017,107799.29999999999,7158.4899999999943]
[1,"Boise Independent District",122740046,{"$f":"IFERROR(VLOOKUP($A17,Awarded!$A$2:$J$196,4,FALSE),0)","v":294674.17000000004},{"$f":"IFERROR(VLOOKUP($A17,Awarded!$A$2:$J$196,5,FALSE),0)","v":3814026.67},{"$f":"IFERROR(VLOOKUP($A17,Awarded!$A$2:$J$196,6,FALSE),0)","v":0},{"$f":"IFERROR(VLOOKUP($A17,Awarded!$A$2:$J$196,7,FALSE),0)","v":14756756.48},{"$f":"IFERROR(VLOOKUP($A17,Awarded!$A$2:$J$196,8,FALSE),0)","v":0},{"$f":"IFERROR(VLOOKUP($A17,Awarded!$A$2:$J$196,9,FALSE),0)","v":26495868.280000001},{"$f":"IFERROR(VLOOKUP($A17,Awarded!$A$2:$J$196,10,FALSE),0)","v":6618703.5700000003},{"$f":"IFERROR(VLOOKUP($A17,Expended!$A$2:$J$198,5,FALSE),0)","v":0},{"$f":"IFERROR(VLOOKUP($A17,Expended!$A$2:$J$198,6,FALSE),0)","v":0},{"$f":"IFERROR(VLOOKUP($A17,Expended!$A$2:$J$198,7,FALSE),0)","v":0},{"$f":"IFERROR(VLOOKUP($A17,Expended!$A$2:$J$198,8,FALSE),0)","v":8455995.6799999997},{"$f":"IFERROR(VLOOKUP($A17,Expended!$A$2:$J$198,9,FALSE),0)","v":0},{"$f":"IFERROR(VLOOKUP($A17,Expended!$A$2:$J$198,10,FALSE),0)","v":4960749.290000001},{"$f":"IFERROR(VLOOKUP($A17,Expended!$A$2:$L$198,11,FALSE),0)","v":1291315.46},{"$f":"VLOOKUP($A17,Prior!$A$1:$K$199,5,FALSE)","v":283938},{"$f":"VLOOKUP($A17,Prior!$A$1:$K$199,6,FALSE)","v":3810114},{"$f":"VLOOKUP($A17,Prior!$A$1:$K$199,7,FALSE)","v":0},{"$f":"VLOOKUP($A17,Prior!$A$1:$K$199,8,FALSE)","v":5325500.68},{"$f":"VLOOKUP($A17,Prior!$A$1:$K$199,9,FALSE)","v":0},{"$f":"VLOOKUP($A17,Prior!$A$1:$K$199,10,FALSE)","v":0},{"$f":"VLOOKUP($A17,Prior!$A$1:$K$199,11,FALSE)","v":380332.88},10736.170000000042,3912.6699999999255,0,975260.12000000104,0,21535118.990000002,4947055.2300000004]
[93,"BONNEVILLE JOINT DISTRICT",879016822,{"$f":"IFERROR(VLOOKUP($A18,Awarded!$A$2:$J$196,4,FALSE),0)","v":159584.18},{"$f":"IFERROR(VLOOKUP($A18,Awarded!$A$2:$J$196,5,FALSE),0)","v":1257543.06},{"$f":"IFERROR(VLOOKUP($A18,Awarded!$A$2:$J$196,6,FALSE),0)","v":637538.11},{"$f":"IFERROR(VLOOKUP($A18,Awarded!$A$2:$J$196,7,FALSE),0)","v":5025717.88},{"$f":"IFERROR(VLOOKUP($A18,Awarded!$A$2:$J$196,8,FALSE),0)","v":0},{"$f":"IFERROR(VLOOKUP($A18,Awarded!$A$2:$J$196,9,FALSE),0)","v":9023715.6099999994},{"$f":"IFERROR(VLOOKUP($A18,Awarded!$A$2:$J$196,10,FALSE),0)","v":2254136.31},{"$f":"IFERROR(VLOOKUP($A18,Expended!$A$2:$J$198,5,FALSE),0)","v":3053.18},{"$f":"IFERROR(VLOOKUP($A18,Expended!$A$2:$J$198,6,FALSE),0)","v":1290.06},{"$f":"IFERROR(VLOOKUP($A18,Expended!$A$2:$J$198,7,FALSE),0)","v":13040.11},{"$f":"IFERROR(VLOOKUP($A18,Expended!$A$2:$J$198,8,FALSE),0)","v":11280.88},{"$f":"IFERROR(VLOOKUP($A18,Expended!$A$2:$J$198,9,FALSE),0)","v":0},{"$f":"IFERROR(VLOOKUP($A18,Expended!$A$2:$J$198,10,FALSE),0)","v":5408338.7200000007},{"$f":"IFERROR(VLOOKUP($A18,Expended!$A$2:$L$198,11,FALSE),0)","v":1269989.4299999997},{"$f":"VLOOKUP($A18,Prior!$A$1:$K$199,5,FALSE)","v":156531},{"$f":"VLOOKUP($A18,Prior!$A$1:$K$199,6,FALSE)","v":1256253},{"$f":"VLOOKUP($A18,Prior!$A$1:$K$199,7,FALSE)","v":624498},{"$f":"VLOOKUP($A18,Prior!$A$1:$K$199,8,FALSE)","v":5014437},{"$f":"VLOOKUP($A18,Prior!$A$1:$K$199,9,FALSE)","v":0},{"$f":"VLOOKUP($A18,Prior!$A$1:$K$199,10,FALSE)","v":459929.55999999994},{"$f":"VLOOKUP($A18,Prior!$A$1:$K$199,11,FALSE)","v":934892.49},0,0,0,0,0,3155447.3299999987,49254.390000000363]
[101,"BOUNDARY COUNTY DISTRICT",10206712,{"$f":"IFERROR(VLOOKUP($A19,Awarded!$A$2:$J$196,4,FALSE),0)","v":27242.35},{"$f":"IFERROR(VLOOKUP($A19,Awarded!$A$2:$J$196,5,FALSE),0)","v":340136.93},{"$f":"IFERROR(VLOOKUP($A19,Awarded!$A$2:$J$196,6,FALSE),0)","v":0},{"$f":"IFERROR(VLOOKUP($A19,Awarded!$A$2:$J$196,7,FALSE),0)","v":1591902.23},{"$f":"IFERROR(VLOOKUP($A19,Awarded!$A$2:$J$196,8,FALSE),0)","v":0},{"$f":"IFERROR(VLOOKUP($A19,Awarded!$A$2:$J$196,9,FALSE),0)","v":2858271.83},{"$f":"IFERROR(VLOOKUP($A19,Awarded!$A$2:$J$196,10,FALSE),0)","v":714000.15},{"$f":"IFERROR(VLOOKUP($A19,Expended!$A$2:$J$198,5,FALSE),0)","v":3799.35},{"$f":"IFERROR(VLOOKUP($A19,Expended!$A$2:$J$198,6,FALSE),0)","v":68090.3},{"$f":"IFERROR(VLOOKUP($A19,Expended!$A$2:$J$198,7,FALSE),0)","v":0},{"$f":"IFERROR(VLOOKUP($A19,Expended!$A$2:$J$198,8,FALSE),0)","v":765602.36999999988},{"$f":"IFERROR(VLOOKUP($A19,Expended!$A$2:$J$198,9,FALSE),0)","v":0},{"$f":"IFERROR(VLOOKUP($A19,Expended!$A$2:$J$198,10,FALSE),0)","v":1689530.4300000002},{"$f":"IFERROR(VLOOKUP($A19,Expended!$A$2:$L$198,11,FALSE),0)","v":239717.35000000003},{"$f":"VLOOKUP($A19,Prior!$A$1:$K$199,5,FALSE)","v":23443},{"$f":"VLOOKUP($A19,Prior!$A$1:$K$199,6,FALSE)","v":272046.63},{"$f":"VLOOKUP($A19,Prior!$A$1:$K$199,7,FALSE)","v":0},{"$f":"VLOOKUP($A19,Prior!$A$1:$K$199,8,FALSE)","v":713677.67000000016},{"$f":"VLOOKUP($A19,Prior!$A$1:$K$199,9,FALSE)","v":0},{"$f":"VLOOKUP($A19,Prior!$A$1:$K$199,10,FALSE)","v":53911.15},{"$f":"VLOOKUP($A19,Prior!$A$1:$K$199,11,FALSE)","v":0},0,0,0,112622.18999999994,0,1114830.25,474282.8]
[365,"BRUNEAU-GRAND VIEW JOINT SCHOOL DISTRICT",29868007,{"$f":"IFERROR(VLOOKUP($A20,Awarded!$A$2:$J$196,4,FALSE),0)","v":11633.18},{"$f":"IFERROR(VLOOKUP($A20,Awarded!$A$2:$J$196,5,FALSE),0)","v":95210.67},{"$f":"IFERROR(VLOOKUP($A20,Awarded!$A$2:$J$196,6,FALSE),0)","v":0},{"$f":"IFERROR(VLOOKUP($A20,Awarded!$A$2:$J$196,7,FALSE),0)","v":380504.09},{"$f":"IFERROR(VLOOKUP($A20,Awarded!$A$2:$J$196,8,FALSE),0)","v":0},{"$f":"IFERROR(VLOOKUP($A20,Awarded!$A$2:$J$196,9,FALSE),0)","v":683197.61},{"$f":"IFERROR(VLOOKUP($A20,Awarded!$A$2:$J$196,10,FALSE),0)","v":170664.18},{"$f":"IFERROR(VLOOKUP($A20,Expended!$A$2:$J$198,5,FALSE),0)","v":7225.18},{"$f":"IFERROR(VLOOKUP($A20,Expended!$A$2:$J$198,6,FALSE),0)","v":97.67},{"$f":"IFERROR(VLOOKUP($A20,Expended!$A$2:$J$198,7,FALSE),0)","v":0},{"$f":"IFERROR(VLOOKUP($A20,Expended!$A$2:$J$198,8,FALSE),0)","v":52167.19},{"$f":"IFERROR(VLOOKUP($A20,Expended!$A$2:$J$198,9,FALSE),0)","v":0},{"$f":"IFERROR(VLOOKUP($A20,Expended!$A$2:$J$198,10,FALSE),0)","v":233748.83},{"$f":"IFERROR(VLOOKUP($A20,Expended!$A$2:$L$198,11,FALSE),0)","v":18679.919999999998},{"$f":"VLOOKUP($A20,Prior!$A$1:$K$199,5,FALSE)","v":4408},{"$f":"VLOOKUP($A20,Prior!$A$1:$K$199,6,FALSE)","v":95113},{"$f":"VLOOKUP($A20,Prior!$A$1:$K$199,7,FALSE)","v":0},{"$f":"VLOOKUP($A20,Prior!$A$1:$K$199,8,FALSE)","v":328336.90000000002},{"$f":"VLOOKUP($A20,Prior!$A$1:$K$199,9,FALSE)","v":0},{"$f":"VLOOKUP($A20,Prior!$A$1:$K$199,10,FALSE)","v":100736.84},{"$f":"VLOOKUP($A20,Prior!$A$1:$K$199,11,FALSE)","v":0},0,0,0,0,0,348711.94000000006,151984.26]
[412,"BUHL JOINT DISTRICT",100014851,{"$f":"IFERROR(VLOOKUP($A21,Awarded!$A$2:$J$196,4,FALSE),0)","v":22433.18},{"$f":"IFERROR(VLOOKUP($A21,Awarded!$A$2:$J$196,5,FALSE),0)","v":256739.38},{"$f":"IFERROR(VLOOKUP($A21,Awarded!$A$2:$J$196,6,FALSE),0)","v":0},{"$f":"IFERROR(VLOOKUP($A21,Awarded!$A$2:$J$196,7,FALSE),0)","v":1101169.72},{"$f":"IFERROR(VLOOKUP($A21,Awarded!$A$2:$J$196,8,FALSE),0)","v":0},{"$f":"IFERROR(VLOOKUP($A21,Awarded!$A$2:$J$196,9,FALSE),0)","v":1977158.9},{"$f":"IFERROR(VLOOKUP($A21,Awarded!$A$2:$J$196,10,FALSE),0)","v":493896.95},{"$f":"IFERROR(VLOOKUP($A21,Expended!$A$2:$J$198,5,FALSE),0)","v":0},{"$f":"IFERROR(VLOOKUP($A21,Expended!$A$2:$J$198,6,FALSE),0)","v":0},{"$f":"IFERROR(VLOOKUP($A21,Expended!$A$2:$J$198,7,FALSE),0)","v":0},{"$f":"IFERROR(VLOOKUP($A21,Expended!$A$2:$J$198,8,FALSE),0)","v":375802.36},{"$f":"IFERROR(VLOOKUP($A21,Expended!$A$2:$J$198,9,FALSE),0)","v":0},{"$f":"IFERROR(VLOOKUP($A21,Expended!$A$2:$J$198,10,FALSE),0)","v":423054.02999999997},{"$f":"IFERROR(VLOOKUP($A21,Expended!$A$2:$L$198,11,FALSE),0)","v":310362.25000000006},{"$f":"VLOOKUP($A21,Prior!$A$1:$K$199,5,FALSE)","v":21629},{"$f":"VLOOKUP($A21,Prior!$A$1:$K$199,6,FALSE)","v":256476},{"$f":"VLOOKUP($A21,Prior!$A$1:$K$199,7,FALSE)","v":0},{"$f":"VLOOKUP($A21,Prior!$A$1:$K$199,8,FALSE)","v":725367.35999999987},{"$f":"VLOOKUP($A21,Prior!$A$1:$K$199,9,FALSE)","v":0},{"$f":"VLOOKUP($A21,Prior!$A$1:$K$199,10,FALSE)","v":0},{"$f":"VLOOKUP($A21,Prior!$A$1:$K$199,11,FALSE)","v":0},804.18000000000029,263.38000000000466,0,0,0,1554104.8699999999,183534.69999999995]
[111,"BUTTE COUNTY JOINT DISTRICT",29645454,{"$f":"IFERROR(VLOOKUP($A22,Awarded!$A$2:$J$196,4,FALSE),0)","v":15078},{"$f":"IFERROR(VLOOKUP($A22,Awarded!$A$2:$J$196,5,FALSE),0)","v":73248.14},{"$f":"IFERROR(VLOOKUP($A22,Awarded!$A$2:$J$196,6,FALSE),0)","v":0},{"$f":"IFERROR(VLOOKUP($A22,Awarded!$A$2:$J$196,7,FALSE),0)","v":287586.53000000003},{"$f":"IFERROR(VLOOKUP($A22,Awarded!$A$2:$J$196,8,FALSE),0)","v":0},{"$f":"IFERROR(VLOOKUP($A22,Awarded!$A$2:$J$196,9,FALSE),0)","v":516363.3},{"$f":"IFERROR(VLOOKUP($A22,Awarded!$A$2:$J$196,10,FALSE),0)","v":128988},{"$f":"IFERROR(VLOOKUP($A22,Expended!$A$2:$J$198,5,FALSE),0)","v":12260},{"$f":"IFERROR(VLOOKUP($A22,Expended!$A$2:$J$198,6,FALSE),0)","v":49682.62},{"$f":"IFERROR(VLOOKUP($A22,Expended!$A$2:$J$198,7,FALSE),0)","v":0},{"$f":"IFERROR(VLOOKUP($A22,Expended!$A$2:$J$198,8,FALSE),0)","v":217838.39},{"$f":"IFERROR(VLOOKUP($A22,Expended!$A$2:$J$198,9,FALSE),0)","v":0},{"$f":"IFERROR(VLOOKUP($A22,Expended!$A$2:$J$198,10,FALSE),0)","v":177554.26},{"$f":"IFERROR(VLOOKUP($A22,Expended!$A$2:$L$198,11,FALSE),0)","v":92949.959999999992},{"$f":"VLOOKUP($A22,Prior!$A$1:$K$199,5,FALSE)","v":2818},{"$f":"VLOOKUP($A22,Prior!$A$1:$K$199,6,FALSE)","v":23565.52},{"$f":"VLOOKUP($A22,Prior!$A$1:$K$199,7,FALSE)","v":0},{"$f":"VLOOKUP($A22,Prior!$A$1:$K$199,8,FALSE)","v":0},{"$f":"VLOOKUP($A22,Prior!$A$1:$K$199,9,FALSE)","v":0},{"$f":"VLOOKUP($A22,Prior!$A$1:$K$199,10,FALSE)","v":0},{"$f":"VLOOKUP($A22,Prior!$A$1:$K$199,11,FALSE)","v":0},0,0,0,69748.140000000014,0,338809.04,36038.040000000008]
[132,"CALDWELL DISTRICT",100014869,{"$f":"IFERROR(VLOOKUP($A23,Awarded!$A$2:$J$196,4,FALSE),0)","v":76899.520000000004},{"$f":"IFERROR(VLOOKUP($A23,Awarded!$A$2:$J$196,5,FALSE),0)","v":1594660.9},{"$f":"IFERROR(VLOOKUP($A23,Awarded!$A$2:$J$196,6,FALSE),0)","v":0},{"$f":"IFERROR(VLOOKUP($A23,Awarded!$A$2:$J$196,7,FALSE),0)","v":6372999.0300000003},{"$f":"IFERROR(VLOOKUP($A23,Awarded!$A$2:$J$196,8,FALSE),0)","v":0},{"$f":"IFERROR(VLOOKUP($A23,Awarded!$A$2:$J$196,9,FALSE),0)","v":11442768.529999999},{"$f":"IFERROR(VLOOKUP($A23,Awarded!$A$2:$J$196,10,FALSE),0)","v":2858419.49},{"$f":"IFERROR(VLOOKUP($A23,Expended!$A$2:$J$198,5,FALSE),0)","v":76899.520000000004},{"$f":"IFERROR(VLOOKUP($A23,Expended!$A$2:$J$198,6,FALSE),0)","v":1635.9},{"$f":"IFERROR(VLOOKUP($A23,Expended!$A$2:$J$198,7,FALSE),0)","v":0},{"$f":"IFERROR(VLOOKUP($A23,Expended!$A$2:$J$198,8,FALSE),0)","v":3121573.07},{"$f":"IFERROR(VLOOKUP($A23,Expended!$A$2:$J$198,9,FALSE),0)","v":0},{"$f":"IFERROR(VLOOKUP($A23,Expended!$A$2:$J$198,10,FALSE),0)","v":356839.05000000005},{"$f":"IFERROR(VLOOKUP($A23,Expended!$A$2:$L$198,11,FALSE),0)","v":1749390.46},{"$f":"VLOOKUP($A23,Prior!$A$1:$K$199,5,FALSE)","v":0},{"$f":"VLOOKUP($A23,Prior!$A$1:$K$199,6,FALSE)","v":1593025},{"$f":"VLOOKUP($A23,Prior!$A$1:$K$199,7,FALSE)","v":0},{"$f":"VLOOKUP($A23,Prior!$A$1:$K$199,8,FALSE)","v":3251425.96},{"$f":"VLOOKUP($A23,Prior!$A$1:$K$199,9,FALSE)","v":0},{"$f":"VLOOKUP($A23,Prior!$A$1:$K$199,10,FALSE)","v":0},{"$f":"VLOOKUP($A23,Prior!$A$1:$K$199,11,FALSE)","v":0},0,0,0,0,0,11085929.479999999,1109029.0300000003]
[121,"CAMAS COUNTY DISTRICT",100185412,{"$f":"IFERROR(VLOOKUP($A24,Awarded!$A$2:$J$196,4,FALSE),0)","v":12806.92},{"$f":"IFERROR(VLOOKUP($A24,Awarded!$A$2:$J$196,5,FALSE),0)","v":17712.169999999998},{"$f":"IFERROR(VLOOKUP($A24,Awarded!$A$2:$J$196,6,FALSE),0)","v":26920.63},{"$f":"IFERROR(VLOOKUP($A24,Awarded!$A$2:$J$196,7,FALSE),0)","v":86464.08},{"$f":"IFERROR(VLOOKUP($A24,Awarded!$A$2:$J$196,8,FALSE),0)","v":156070},{"$f":"IFERROR(VLOOKUP($A24,Awarded!$A$2:$J$196,9,FALSE),0)","v":155246.88},{"$f":"IFERROR(VLOOKUP($A24,Awarded!$A$2:$J$196,10,FALSE),0)","v":38781.129999999997},{"$f":"IFERROR(VLOOKUP($A24,Expended!$A$2:$J$198,5,FALSE),0)","v":3146.92},{"$f":"IFERROR(VLOOKUP($A24,Expended!$A$2:$J$198,6,FALSE),0)","v":18.170000000000002},{"$f":"IFERROR(VLOOKUP($A24,Expended!$A$2:$J$198,7,FALSE),0)","v":550.63},{"$f":"IFERROR(VLOOKUP($A24,Expended!$A$2:$J$198,8,FALSE),0)","v":194.08},{"$f":"IFERROR(VLOOKUP($A24,Expended!$A$2:$J$198,9,FALSE),0)","v":112376.2},{"$f":"IFERROR(VLOOKUP($A24,Expended!$A$2:$J$198,10,FALSE),0)","v":43883.35},{"$f":"IFERROR(VLOOKUP($A24,Expended!$A$2:$L$198,11,FALSE),0)","v":14.13},{"$f":"VLOOKUP($A24,Prior!$A$1:$K$199,5,FALSE)","v":9660},{"$f":"VLOOKUP($A24,Prior!$A$1:$K$199,6,FALSE)","v":17694},{"$f":"VLOOKUP($A24,Prior!$A$1:$K$199,7,FALSE)","v":26370},{"$f":"VLOOKUP($A24,Prior!$A$1:$K$199,8,FALSE)","v":86270},{"$f":"VLOOKUP($A24,Prior!$A$1:$K$199,9,FALSE)","v":10455},{"$f":"VLOOKUP($A24,Prior!$A$1:$K$199,10,FALSE)","v":0},{"$f":"VLOOKUP($A24,Prior!$A$1:$K$199,11,FALSE)","v":38767},0,0,0,0,33238.800000000003,111363.53,0]
[432,"CAMBRIDGE JOINT DISTRICT",112893883,{"$f":"IFERROR(VLOOKUP($A25,Awarded!$A$2:$J$196,4,FALSE),0)","v":9401},{"$f":"IFERROR(VLOOKUP($A25,Awarded!$A$2:$J$196,5,FALSE),0)","v":38776.78},{"$f":"IFERROR(VLOOKUP($A25,Awarded!$A$2:$J$196,6,FALSE),0)","v":0},{"$f":"IFERROR(VLOOKUP($A25,Awarded!$A$2:$J$196,7,FALSE),0)","v":144960.38},{"$f":"IFERROR(VLOOKUP($A25,Awarded!$A$2:$J$196,8,FALSE),0)","v":25448},{"$f":"IFERROR(VLOOKUP($A25,Awarded!$A$2:$J$196,9,FALSE),0)","v":260278.58},{"$f":"IFERROR(VLOOKUP($A25,Awarded!$A$2:$J$196,10,FALSE),0)","v":65017.69},{"$f":"IFERROR(VLOOKUP($A25,Expended!$A$2:$J$198,5,FALSE),0)","v":261},{"$f":"IFERROR(VLOOKUP($A25,Expended!$A$2:$J$198,6,FALSE),0)","v":39.78},{"$f":"IFERROR(VLOOKUP($A25,Expended!$A$2:$J$198,7,FALSE),0)","v":0},{"$f":"IFERROR(VLOOKUP($A25,Expended!$A$2:$J$198,8,FALSE),0)","v":22753.15},{"$f":"IFERROR(VLOOKUP($A25,Expended!$A$2:$J$198,9,FALSE),0)","v":0},{"$f":"IFERROR(VLOOKUP($A25,Expended!$A$2:$J$198,10,FALSE),0)","v":0},{"$f":"IFERROR(VLOOKUP($A25,Expended!$A$2:$L$198,11,FALSE),0)","v":4723.88},{"$f":"VLOOKUP($A25,Prior!$A$1:$K$199,5,FALSE)","v":9140},{"$f":"VLOOKUP($A25,Prior!$A$1:$K$199,6,FALSE)","v":38737},{"$f":"VLOOKUP($A25,Prior!$A$1:$K$199,7,FALSE)","v":0},{"$f":"VLOOKUP($A25,Prior!$A$1:$K$199,8,FALSE)","v":27121.18},{"$f":"VLOOKUP($A25,Prior!$A$1:$K$199,9,FALSE)","v":0},{"$f":"VLOOKUP($A25,Prior!$A$1:$K$199,10,FALSE)","v":25972.83},{"$f":"VLOOKUP($A25,Prior!$A$1:$K$199,11,FALSE)","v":3377.35},0,0,0,95086.050000000017,25448,234305.75,56916.460000000006]
[555,"CANYON-OWYHEE SCHOOL SERVICE AGENCY (COSSA)",29765393,{"$f":"IFERROR(VLOOKUP($A26,Awarded!$A$2:$J$196,4,FALSE),0)","v":9527.1299999999992},{"$f":"IFERROR(VLOOKUP($A26,Awarded!$A$2:$J$196,5,FALSE),0)","v":0},{"$f":"IFERROR(VLOOKUP($A26,Awarded!$A$2:$J$196,6,FALSE),0)","v":62107.33},{"$f":"IFERROR(VLOOKUP($A26,Awarded!$A$2:$J$196,7,FALSE),0)","v":0},{"$f":"IFERROR(VLOOKUP($A26,Awarded!$A$2:$J$196,8,FALSE),0)","v":0},{"$f":"IFERROR(VLOOKUP($A26,Awarded!$A$2:$J$196,9,FALSE),0)","v":0},{"$f":"IFERROR(VLOOKUP($A26,Awarded!$A$2:$J$196,10,FALSE),0)","v":0},{"$f":"IFERROR(VLOOKUP($A26,Expended!$A$2:$J$198,5,FALSE),0)","v":331.07},{"$f":"IFERROR(VLOOKUP($A26,Expended!$A$2:$J$198,6,FALSE),0)","v":0},{"$f":"IFERROR(VLOOKUP($A26,Expended!$A$2:$J$198,7,FALSE),0)","v":1271.33},{"$f":"IFERROR(VLOOKUP($A26,Expended!$A$2:$J$198,8,FALSE),0)","v":0},{"$f":"IFERROR(VLOOKUP($A26,Expended!$A$2:$J$198,9,FALSE),0)","v":0},{"$f":"IFERROR(VLOOKUP($A26,Expended!$A$2:$J$198,10,FALSE),0)","v":0},{"$f":"IFERROR(VLOOKUP($A26,Expended!$A$2:$L$198,11,FALSE),0)","v":0},{"$f":"VLOOKUP($A26,Prior!$A$1:$K$199,5,FALSE)","v":9158},{"$f":"VLOOKUP($A26,Prior!$A$1:$K$199,6,FALSE)","v":0},{"$f":"VLOOKUP($A26,Prior!$A$1:$K$199,7,FALSE)","v":60836},{"$f":"VLOOKUP($A26,Prior!$A$1:$K$199,8,FALSE)","v":0},{"$f":"VLOOKUP($A26,Prior!$A$1:$K$199,9,FALSE)","v":0},{"$f":"VLOOKUP($A26,Prior!$A$1:$K$199,10,FALSE)","v":0},{"$f":"VLOOKUP($A26,Prior!$A$1:$K$199,11,FALSE)","v":0},38.059999999999491,0,0,0,0,0,0]
[566,"CARDINAL ACADEMY INCORPORATED",108110500,{"$f":"IFERROR(VLOOKUP($A27,Awarded!$A$2:$J$196,4,FALSE),0)","v":0},{"$f":"IFERROR(VLOOKUP($A27,Awarded!$A$2:$J$196,5,FALSE),0)","v":0},{"$f":"IFERROR(VLOOKUP($A27,Awarded!$A$2:$J$196,6,FALSE),0)","v":0},{"$f":"IFERROR(VLOOKUP($A27,Awarded!$A$2:$J$196,7,FALSE),0)","v":61920.99},{"$f":"IFERROR(VLOOKUP($A27,Awarded!$A$2:$J$196,8,FALSE),0)","v":141565},{"$f":"IFERROR(VLOOKUP($A27,Awarded!$A$2:$J$196,9,FALSE),0)","v":111178.82},{"$f":"IFERROR(VLOOKUP($A27,Awarded!$A$2:$J$196,10,FALSE),0)","v":27773.119999999999},{"$f":"IFERROR(VLOOKUP($A27,Expended!$A$2:$J$198,5,FALSE),0)","v":0},{"$f":"IFERROR(VLOOKUP($A27,Expended!$A$2:$J$198,6,FALSE),0)","v":0},{"$f":"IFERROR(VLOOKUP($A27,Expended!$A$2:$J$198,7,FALSE),0)","v":0},{"$f":"IFERROR(VLOOKUP($A27,Expended!$A$2:$J$198,8,FALSE),0)","v":1219.3},{"$f":"IFERROR(VLOOKUP($A27,Expended!$A$2:$J$198,9,FALSE),0)","v":0},{"$f":"IFERROR(VLOOKUP($A27,Expended!$A$2:$J$198,10,FALSE),0)","v":0},{"$f":"IFERROR(VLOOKUP($A27,Expended!$A$2:$L$198,11,FALSE),0)","v":0},{"$f":"VLOOKUP($A27,Prior!$A$1:$K$199,5,FALSE)","v":0},{"$f":"VLOOKUP($A27,Prior!$A$1:$K$199,6,FALSE)","v":0},{"$f":"VLOOKUP($A27,Prior!$A$1:$K$199,7,FALSE)","v":0},{"$f":"VLOOKUP($A27,Prior!$A$1:$K$199,8,FALSE)","v":57285.479999999996},{"$f":"VLOOKUP($A27,Prior!$A$1:$K$199,9,FALSE)","v":0},{"$f":"VLOOKUP($A27,Prior!$A$1:$K$199,10,FALSE)","v":31840.260000000002},{"$f":"VLOOKUP($A27,Prior!$A$1:$K$199,11,FALSE)","v":27763},0,0,0,3416.2099999999991,141565,79338.559999999998,10.119999999998981]
[422,"CASCADE DISTRICT",100014885,{"$f":"IFERROR(VLOOKUP($A28,Awarded!$A$2:$J$196,4,FALSE),0)","v":10315},{"$f":"IFERROR(VLOOKUP($A28,Awarded!$A$2:$J$196,5,FALSE),0)","v":138251.82999999999},{"$f":"IFERROR(VLOOKUP($A28,Awarded!$A$2:$J$196,6,FALSE),0)","v":0},{"$f":"IFERROR(VLOOKUP($A28,Awarded!$A$2:$J$196,7,FALSE),0)","v":626608.51},{"$f":"IFERROR(VLOOKUP($A28,Awarded!$A$2:$J$196,8,FALSE),0)","v":0},{"$f":"IFERROR(VLOOKUP($A28,Awarded!$A$2:$J$196,9,FALSE),0)","v":1125080.6100000001},{"$f":"IFERROR(VLOOKUP($A28,Awarded!$A$2:$J$196,10,FALSE),0)","v":281046.40000000002},{"$f":"IFERROR(VLOOKUP($A28,Expended!$A$2:$J$198,5,FALSE),0)","v":2183},{"$f":"IFERROR(VLOOKUP($A28,Expended!$A$2:$J$198,6,FALSE),0)","v":141.83000000000001},{"$f":"IFERROR(VLOOKUP($A28,Expended!$A$2:$J$198,7,FALSE),0)","v":0},{"$f":"IFERROR(VLOOKUP($A28,Expended!$A$2:$J$198,8,FALSE),0)","v":176231.37},{"$f":"IFERROR(VLOOKUP($A28,Expended!$A$2:$J$198,9,FALSE),0)","v":0},{"$f":"IFERROR(VLOOKUP($A28,Expended!$A$2:$J$198,10,FALSE),0)","v":373069.27},{"$f":"IFERROR(VLOOKUP($A28,Expended!$A$2:$L$198,11,FALSE),0)","v":38267.67},{"$f":"VLOOKUP($A28,Prior!$A$1:$K$199,5,FALSE)","v":8132},{"$f":"VLOOKUP($A28,Prior!$A$1:$K$199,6,FALSE)","v":138110},{"$f":"VLOOKUP($A28,Prior!$A$1:$K$199,7,FALSE)","v":0},{"$f":"VLOOKUP($A28,Prior!$A$1:$K$199,8,FALSE)","v":373421.82},{"$f":"VLOOKUP($A28,Prior!$A$1:$K$199,9,FALSE)","v":0},{"$f":"VLOOKUP($A28,Prior!$A$1:$K$199,10,FALSE)","v":436.98},{"$f":"VLOOKUP($A28,Prior!$A$1:$K$199,11,FALSE)","v":12065.880000000001},0,0,0,76955.320000000007,0,751574.3600000001,230712.85000000003]
[151,"CASSIA COUNTY JOINT DISTRICT",879016707,{"$f":"IFERROR(VLOOKUP($A29,Awarded!$A$2:$J$196,4,FALSE),0)","v":72032.179999999993},{"$f":"IFERROR(VLOOKUP($A29,Awarded!$A$2:$J$196,5,FALSE),0)","v":733963.94},{"$f":"IFERROR(VLOOKUP($A29,Awarded!$A$2:$J$196,6,FALSE),0)","v":0},{"$f":"IFERROR(VLOOKUP($A29,Awarded!$A$2:$J$196,7,FALSE),0)","v":3092685.94},{"$f":"IFERROR(VLOOKUP($A29,Awarded!$A$2:$J$196,8,FALSE),0)","v":0},{"$f":"IFERROR(VLOOKUP($A29,Awarded!$A$2:$J$196,9,FALSE),0)","v":5552941.0899999999},{"$f":"IFERROR(VLOOKUP($A29,Awarded!$A$2:$J$196,10,FALSE),0)","v":1387132.41},{"$f":"IFERROR(VLOOKUP($A29,Expended!$A$2:$J$198,5,FALSE),0)","v":5089.18},{"$f":"IFERROR(VLOOKUP($A29,Expended!$A$2:$J$198,6,FALSE),0)","v":752.94},{"$f":"IFERROR(VLOOKUP($A29,Expended!$A$2:$J$198,7,FALSE),0)","v":0},{"$f":"IFERROR(VLOOKUP($A29,Expended!$A$2:$J$198,8,FALSE),0)","v":476056.11000000004},{"$f":"IFERROR(VLOOKUP($A29,Expended!$A$2:$J$198,9,FALSE),0)","v":0},{"$f":"IFERROR(VLOOKUP($A29,Expended!$A$2:$J$198,10,FALSE),0)","v":2335522.7599999998},{"$f":"IFERROR(VLOOKUP($A29,Expended!$A$2:$L$198,11,FALSE),0)","v":679428.5199999999},{"$f":"VLOOKUP($A29,Prior!$A$1:$K$199,5,FALSE)","v":66943},{"$f":"VLOOKUP($A29,Prior!$A$1:$K$199,6,FALSE)","v":733210.99999999988},{"$f":"VLOOKUP($A29,Prior!$A$1:$K$199,7,FALSE)","v":0},{"$f":"VLOOKUP($A29,Prior!$A$1:$K$199,8,FALSE)","v":2345721.06},{"$f":"VLOOKUP($A29,Prior!$A$1:$K$199,9,FALSE)","v":0},{"$f":"VLOOKUP($A29,Prior!$A$1:$K$199,10,FALSE)","v":2702426.95},{"$f":"VLOOKUP($A29,Prior!$A$1:$K$199,11,FALSE)","v":676.48},0,0,0,270908.77,0,514991.37999999989,707027.41]
[417,"CASTLEFORD DISTRICT",181912668,{"$f":"IFERROR(VLOOKUP($A30,Awarded!$A$2:$J$196,4,FALSE),0)","v":14339.56},{"$f":"IFERROR(VLOOKUP($A30,Awarded!$A$2:$J$196,5,FALSE),0)","v":56111.56},{"$f":"IFERROR(VLOOKUP($A30,Awarded!$A$2:$J$196,6,FALSE),0)","v":0},{"$f":"IFERROR(VLOOKUP($A30,Awarded!$A$2:$J$196,7,FALSE),0)","v":211342.39},{"$f":"IFERROR(VLOOKUP($A30,Awarded!$A$2:$J$196,8,FALSE),0)","v":0},{"$f":"IFERROR(VLOOKUP($A30,Awarded!$A$2:$J$196,9,FALSE),0)","v":379466.68},{"$f":"IFERROR(VLOOKUP($A30,Awarded!$A$2:$J$196,10,FALSE),0)","v":94791.54},{"$f":"IFERROR(VLOOKUP($A30,Expended!$A$2:$J$198,5,FALSE),0)","v":4011.46},{"$f":"IFERROR(VLOOKUP($A30,Expended!$A$2:$J$198,6,FALSE),0)","v":57.56},{"$f":"IFERROR(VLOOKUP($A30,Expended!$A$2:$J$198,7,FALSE),0)","v":0},{"$f":"IFERROR(VLOOKUP($A30,Expended!$A$2:$J$198,8,FALSE),0)","v":474.39},{"$f":"IFERROR(VLOOKUP($A30,Expended!$A$2:$J$198,9,FALSE),0)","v":0},{"$f":"IFERROR(VLOOKUP($A30,Expended!$A$2:$J$198,10,FALSE),0)","v":229019.85},{"$f":"IFERROR(VLOOKUP($A30,Expended!$A$2:$L$198,11,FALSE),0)","v":64884.119999999995},{"$f":"VLOOKUP($A30,Prior!$A$1:$K$199,5,FALSE)","v":10326.939999999999},{"$f":"VLOOKUP($A30,Prior!$A$1:$K$199,6,FALSE)","v":56054},{"$f":"VLOOKUP($A30,Prior!$A$1:$K$199,7,FALSE)","v":0},{"$f":"VLOOKUP($A30,Prior!$A$1:$K$199,8,FALSE)","v":210868},{"$f":"VLOOKUP($A30,Prior!$A$1:$K$199,9,FALSE)","v":0},{"$f":"VLOOKUP($A30,Prior!$A$1:$K$199,10,FALSE)","v":23412.82},{"$f":"VLOOKUP($A30,Prior!$A$1:$K$199,11,FALSE)","v":21086.57},1.1599999999998545,0,0,0,0,127034.00999999998,8820.8499999999985]
[181,"CHALLIS JOINT DISTRICT",193218112,{"$f":"IFERROR(VLOOKUP($A31,Awarded!$A$2:$J$196,4,FALSE),0)","v":14207.130000000001},{"$f":"IFERROR(VLOOKUP($A31,Awarded!$A$2:$J$196,5,FALSE),0)","v":71388.23},{"$f":"IFERROR(VLOOKUP($A31,Awarded!$A$2:$J$196,6,FALSE),0)","v":0},{"$f":"IFERROR(VLOOKUP($A31,Awarded!$A$2:$J$196,7,FALSE),0)","v":475096.42},{"$f":"IFERROR(VLOOKUP($A31,Awarded!$A$2:$J$196,8,FALSE),0)","v":0},{"$f":"IFERROR(VLOOKUP($A31,Awarded!$A$2:$J$196,9,FALSE),0)","v":853039.4},{"$f":"IFERROR(VLOOKUP($A31,Awarded!$A$2:$J$196,10,FALSE),0)","v":213090.64},{"$f":"IFERROR(VLOOKUP($A31,Expended!$A$2:$J$198,5,FALSE),0)","v":2952.13},{"$f":"IFERROR(VLOOKUP($A31,Expended!$A$2:$J$198,6,FALSE),0)","v":73.23},{"$f":"IFERROR(VLOOKUP($A31,Expended!$A$2:$J$198,7,FALSE),0)","v":0},{"$f":"IFERROR(VLOOKUP($A31,Expended!$A$2:$J$198,8,FALSE),0)","v":22398.010000000002},{"$f":"IFERROR(VLOOKUP($A31,Expended!$A$2:$J$198,9,FALSE),0)","v":0},{"$f":"IFERROR(VLOOKUP($A31,Expended!$A$2:$J$198,10,FALSE),0)","v":241311.19},{"$f":"IFERROR(VLOOKUP($A31,Expended!$A$2:$L$198,11,FALSE),0)","v":190030.2},{"$f":"VLOOKUP($A31,Prior!$A$1:$K$199,5,FALSE)","v":11255},{"$f":"VLOOKUP($A31,Prior!$A$1:$K$199,6,FALSE)","v":71315},{"$f":"VLOOKUP($A31,Prior!$A$1:$K$199,7,FALSE)","v":0},{"$f":"VLOOKUP($A31,Prior!$A$1:$K$199,8,FALSE)","v":452661.89},{"$f":"VLOOKUP($A31,Prior!$A$1:$K$199,9,FALSE)","v":0},{"$f":"VLOOKUP($A31,Prior!$A$1:$K$199,10,FALSE)","v":0},{"$f":"VLOOKUP($A31,Prior!$A$1:$K$199,11,FALSE)","v":0},0,0,0,36.519999999960419,0,611728.21,23060.440000000002]
[483,"CHIEF TAHGEE ELEMENTARY ACADEMY, INC.",78351211,{"$f":"IFERROR(VLOOKUP($A32,Awarded!$A$2:$J$196,4,FALSE),0)","v":11571},{"$f":"IFERROR(VLOOKUP($A32,Awarded!$A$2:$J$196,5,FALSE),0)","v":25107.759999999998},{"$f":"IFERROR(VLOOKUP($A32,Awarded!$A$2:$J$196,6,FALSE),0)","v":0},{"$f":"IFERROR(VLOOKUP($A32,Awarded!$A$2:$J$196,7,FALSE),0)","v":142957.89000000001},{"$f":"IFERROR(VLOOKUP($A32,Awarded!$A$2:$J$196,8,FALSE),0)","v":29921},{"$f":"IFERROR(VLOOKUP($A32,Awarded!$A$2:$J$196,9,FALSE),0)","v":256681.41},{"$f":"IFERROR(VLOOKUP($A32,Awarded!$A$2:$J$196,10,FALSE),0)","v":64119.360000000001},{"$f":"IFERROR(VLOOKUP($A32,Expended!$A$2:$J$198,5,FALSE),0)","v":2854},{"$f":"IFERROR(VLOOKUP($A32,Expended!$A$2:$J$198,6,FALSE),0)","v":25.76},{"$f":"IFERROR(VLOOKUP($A32,Expended!$A$2:$J$198,7,FALSE),0)","v":0},{"$f":"IFERROR(VLOOKUP($A32,Expended!$A$2:$J$198,8,FALSE),0)","v":49982.55},{"$f":"IFERROR(VLOOKUP($A32,Expended!$A$2:$J$198,9,FALSE),0)","v":7804.34},{"$f":"IFERROR(VLOOKUP($A32,Expended!$A$2:$J$198,10,FALSE),0)","v":151781.95000000001},{"$f":"IFERROR(VLOOKUP($A32,Expended!$A$2:$L$198,11,FALSE),0)","v":43850.26},{"$f":"VLOOKUP($A32,Prior!$A$1:$K$199,5,FALSE)","v":8717},{"$f":"VLOOKUP($A32,Prior!$A$1:$K$199,6,FALSE)","v":25082},{"$f":"VLOOKUP($A32,Prior!$A$1:$K$199,7,FALSE)","v":0},{"$f":"VLOOKUP($A32,Prior!$A$1:$K$199,8,FALSE)","v":89844.82},{"$f":"VLOOKUP($A32,Prior!$A$1:$K$199,9,FALSE)","v":22116.66},{"$f":"VLOOKUP($A32,Prior!$A$1:$K$199,10,FALSE)","v":79350.02},{"$f":"VLOOKUP($A32,Prior!$A$1:$K$199,11,FALSE)","v":20269.099999999999},0,0,0,3130.5200000000041,0,25549.439999999988,0]
[161,"CLARK COUNTY DISTRICT",24714961,{"$f":"IFERROR(VLOOKUP($A33,Awarded!$A$2:$J$196,4,FALSE),0)","v":9328.86},{"$f":"IFERROR(VLOOKUP($A33,Awarded!$A$2:$J$196,5,FALSE),0)","v":25220.87},{"$f":"IFERROR(VLOOKUP($A33,Awarded!$A$2:$J$196,6,FALSE),0)","v":2519.5300000000002},{"$f":"IFERROR(VLOOKUP($A33,Awarded!$A$2:$J$196,7,FALSE),0)","v":113406.56},{"$f":"IFERROR(VLOOKUP($A33,Awarded!$A$2:$J$196,8,FALSE),0)","v":95907},{"$f":"IFERROR(VLOOKUP($A33,Awarded!$A$2:$J$196,9,FALSE),0)","v":203622.93},{"$f":"IFERROR(VLOOKUP($A33,Awarded!$A$2:$J$196,10,FALSE),0)","v":50865.53},{"$f":"IFERROR(VLOOKUP($A33,Expended!$A$2:$J$198,5,FALSE),0)","v":5038.8599999999997},{"$f":"IFERROR(VLOOKUP($A33,Expended!$A$2:$J$198,6,FALSE),0)","v":25.87},{"$f":"IFERROR(VLOOKUP($A33,Expended!$A$2:$J$198,7,FALSE),0)","v":2519.13},{"$f":"IFERROR(VLOOKUP($A33,Expended!$A$2:$J$198,8,FALSE),0)","v":49760.229999999996},{"$f":"IFERROR(VLOOKUP($A33,Expended!$A$2:$J$198,9,FALSE),0)","v":78109.73},{"$f":"IFERROR(VLOOKUP($A33,Expended!$A$2:$J$198,10,FALSE),0)","v":42960.959999999999},{"$f":"IFERROR(VLOOKUP($A33,Expended!$A$2:$L$198,11,FALSE),0)","v":3954.2400000000002},{"$f":"VLOOKUP($A33,Prior!$A$1:$K$199,5,FALSE)","v":4290},{"$f":"VLOOKUP($A33,Prior!$A$1:$K$199,6,FALSE)","v":25195},{"$f":"VLOOKUP($A33,Prior!$A$1:$K$199,7,FALSE)","v":0},{"$f":"VLOOKUP($A33,Prior!$A$1:$K$199,8,FALSE)","v":63646.33},{"$f":"VLOOKUP($A33,Prior!$A$1:$K$199,9,FALSE)","v":0},{"$f":"VLOOKUP($A33,Prior!$A$1:$K$199,10,FALSE)","v":15440.02},{"$f":"VLOOKUP($A33,Prior!$A$1:$K$199,11,FALSE)","v":0},0,0,0.40000000000009095,0,17797.270000000004,145221.95000000001,46911.29]
[491,"COEUR D'ALENE CHARTER ACADEMY, INC.",128705576,{"$f":"IFERROR(VLOOKUP($A34,Awarded!$A$2:$J$196,4,FALSE),0)","v":0},{"$f":"IFERROR(VLOOKUP($A34,Awarded!$A$2:$J$196,5,FALSE),0)","v":0},{"$f":"IFERROR(VLOOKUP($A34,Awarded!$A$2:$J$196,6,FALSE),0)","v":233022.2},{"$f":"IFERROR(VLOOKUP($A34,Awarded!$A$2:$J$196,7,FALSE),0)","v":0},{"$f":"IFERROR(VLOOKUP($A34,Awarded!$A$2:$J$196,8,FALSE),0)","v":349143},{"$f":"IFERROR(VLOOKUP($A34,Awarded!$A$2:$J$196,9,FALSE),0)","v":0},{"$f":"IFERROR(VLOOKUP($A34,Awarded!$A$2:$J$196,10,FALSE),0)","v":0},{"$f":"IFERROR(VLOOKUP($A34,Expended!$A$2:$J$198,5,FALSE),0)","v":0},{"$f":"IFERROR(VLOOKUP($A34,Expended!$A$2:$J$198,6,FALSE),0)","v":0},{"$f":"IFERROR(VLOOKUP($A34,Expended!$A$2:$J$198,7,FALSE),0)","v":102443.36},{"$f":"IFERROR(VLOOKUP($A34,Expended!$A$2:$J$198,8,FALSE),0)","v":0},{"$f":"IFERROR(VLOOKUP($A34,Expended!$A$2:$J$198,9,FALSE),0)","v":144562.51999999999},{"$f":"IFERROR(VLOOKUP($A34,Expended!$A$2:$J$198,10,FALSE),0)","v":0},{"$f":"IFERROR(VLOOKUP($A34,Expended!$A$2:$L$198,11,FALSE),0)","v":0},{"$f":"VLOOKUP($A34,Prior!$A$1:$K$199,5,FALSE)","v":0},{"$f":"VLOOKUP($A34,Prior!$A$1:$K$199,6,FALSE)","v":0},{"$f":"VLOOKUP($A34,Prior!$A$1:$K$199,7,FALSE)","v":130578.84},{"$f":"VLOOKUP($A34,Prior!$A$1:$K$199,8,FALSE)","v":0},{"$f":"VLOOKUP($A34,Prior!$A$1:$K$199,9,FALSE)","v":0},{"$f":"VLOOKUP($A34,Prior!$A$1:$K$199,10,FALSE)","v":0},{"$f":"VLOOKUP($A34,Prior!$A$1:$K$199,11,FALSE)","v":0},0,0,0,0,204580.48000000001,0,0]
[271,"COEUR D'ALENE DISTRICT",85188761,{"$f":"IFERROR(VLOOKUP($A35,Awarded!$A$2:$J$196,4,FALSE),0)","v":132643.24},{"$f":"IFERROR(VLOOKUP($A35,Awarded!$A$2:$J$196,5,FALSE),0)","v":1708356.53},{"$f":"IFERROR(VLOOKUP($A35,Awarded!$A$2:$J$196,6,FALSE),0)","v":0},{"$f":"IFERROR(VLOOKUP($A35,Awarded!$A$2:$J$196,7,FALSE),0)","v":6027011.4199999999},{"$f":"IFERROR(VLOOKUP($A35,Awarded!$A$2:$J$196,8,FALSE),0)","v":0},{"$f":"IFERROR(VLOOKUP($A35,Awarded!$A$2:$J$196,9,FALSE),0)","v":10821544.720000001},{"$f":"IFERROR(VLOOKUP($A35,Awarded!$A$2:$J$196,10,FALSE),0)","v":2703236.94},{"$f":"IFERROR(VLOOKUP($A35,Expended!$A$2:$J$198,5,FALSE),0)","v":39656.06},{"$f":"IFERROR(VLOOKUP($A35,Expended!$A$2:$J$198,6,FALSE),0)","v":35637.159999999996},{"$f":"IFERROR(VLOOKUP($A35,Expended!$A$2:$J$198,7,FALSE),0)","v":0},{"$f":"IFERROR(VLOOKUP($A35,Expended!$A$2:$J$198,8,FALSE),0)","v":1880666.59},{"$f":"IFERROR(VLOOKUP($A35,Expended!$A$2:$J$198,9,FALSE),0)","v":0},{"$f":"IFERROR(VLOOKUP($A35,Expended!$A$2:$J$198,10,FALSE),0)","v":2986513.1},{"$f":"IFERROR(VLOOKUP($A35,Expended!$A$2:$L$198,11,FALSE),0)","v":305044.96999999997},{"$f":"VLOOKUP($A35,Prior!$A$1:$K$199,5,FALSE)","v":92987.18},{"$f":"VLOOKUP($A35,Prior!$A$1:$K$199,6,FALSE)","v":1672719.37},{"$f":"VLOOKUP($A35,Prior!$A$1:$K$199,7,FALSE)","v":0},{"$f":"VLOOKUP($A35,Prior!$A$1:$K$199,8,FALSE)","v":4132816.41},{"$f":"VLOOKUP($A35,Prior!$A$1:$K$199,9,FALSE)","v":0},{"$f":"VLOOKUP($A35,Prior!$A$1:$K$199,10,FALSE)","v":1372198.48},{"$f":"VLOOKUP($A35,Prior!$A$1:$K$199,11,FALSE)","v":95409.709999999992},{"$f":"D35-K35-R35","v":0},{"$f":"E35-L35-S35","v":0},{"$f":"F35-M35-T35","v":0},{"$f":"G35-N35-U35","v":13528.419999999925},{"$f":"H35-O35-V35","v":0},{"$f":"I35-P35-W35","v":6462833.1400000006},{"$f":"J35-Q35-X35","v":2302782.2599999998}]
[455,"COMPASS PUBLIC CHARTER SCHOOL, INC.",165024576,{"$f":"IFERROR(VLOOKUP($A36,Awarded!$A$2:$J$196,4,FALSE),0)","v":20560.18},{"$f":"IFERROR(VLOOKUP($A36,Awarded!$A$2:$J$196,5,FALSE),0)","v":50263.56},{"$f":"IFERROR(VLOOKUP($A36,Awarded!$A$2:$J$196,6,FALSE),0)","v":208202.54},{"$f":"IFERROR(VLOOKUP($A36,Awarded!$A$2:$J$196,7,FALSE),0)","v":271142.62},{"$f":"IFERROR(VLOOKUP($A36,Awarded!$A$2:$J$196,8,FALSE),0)","v":0},{"$f":"IFERROR(VLOOKUP($A36,Awarded!$A$2:$J$196,9,FALSE),0)","v":486839.09},{"$f":"IFERROR(VLOOKUP($A36,Awarded!$A$2:$J$196,10,FALSE),0)","v":121613.31},{"$f":"IFERROR(VLOOKUP($A36,Expended!$A$2:$J$198,5,FALSE),0)","v":189.18},{"$f":"IFERROR(VLOOKUP($A36,Expended!$A$2:$J$198,6,FALSE),0)","v":51.56},{"$f":"IFERROR(VLOOKUP($A36,Expended!$A$2:$J$198,7,FALSE),0)","v":4258.54},{"$f":"IFERROR(VLOOKUP($A36,Expended!$A$2:$J$198,8,FALSE),0)","v":608.62},{"$f":"IFERROR(VLOOKUP($A36,Expended!$A$2:$J$198,9,FALSE),0)","v":0},{"$f":"IFERROR(VLOOKUP($A36,Expended!$A$2:$J$198,10,FALSE),0)","v":191979.19},{"$f":"IFERROR(VLOOKUP($A36,Expended!$A$2:$L$198,11,FALSE),0)","v":54102.58},{"$f":"VLOOKUP($A36,Prior!$A$1:$K$199,5,FALSE)","v":20371},{"$f":"VLOOKUP($A36,Prior!$A$1:$K$199,6,FALSE)","v":50212},{"$f":"VLOOKUP($A36,Prior!$A$1:$K$199,7,FALSE)","v":203944},{"$f":"VLOOKUP($A36,Prior!$A$1:$K$199,8,FALSE)","v":270534},{"$f":"VLOOKUP($A36,Prior!$A$1:$K$199,9,FALSE)","v":0},{"$f":"VLOOKUP($A36,Prior!$A$1:$K$199,10,FALSE)","v":80106.290000000008},{"$f":"VLOOKUP($A36,Prior!$A$1:$K$199,11,FALSE)","v":67510.73000000001},0,0,0,0,0,214753.61000000002,0]
[242,"COTTONWOOD JOINT DISTRICT",100014901,{"$f":"IFERROR(VLOOKUP($A37,Awarded!$A$2:$J$196,4,FALSE),0)","v":14934},{"$f":"IFERROR(VLOOKUP($A37,Awarded!$A$2:$J$196,5,FALSE),0)","v":65726.429999999993},{"$f":"IFERROR(VLOOKUP($A37,Awarded!$A$2:$J$196,6,FALSE),0)","v":0},{"$f":"IFERROR(VLOOKUP($A37,Awarded!$A$2:$J$196,7,FALSE),0)","v":256590.95},{"$f":"IFERROR(VLOOKUP($A37,Awarded!$A$2:$J$196,8,FALSE),0)","v":0},{"$f":"IFERROR(VLOOKUP($A37,Awarded!$A$2:$J$196,9,FALSE),0)","v":460710.82},{"$f":"IFERROR(VLOOKUP($A37,Awarded!$A$2:$J$196,10,FALSE),0)","v":115085.93},{"$f":"IFERROR(VLOOKUP($A37,Expended!$A$2:$J$198,5,FALSE),0)","v":2953},{"$f":"IFERROR(VLOOKUP($A37,Expended!$A$2:$J$198,6,FALSE),0)","v":67.430000000000007},{"$f":"IFERROR(VLOOKUP($A37,Expended!$A$2:$J$198,7,FALSE),0)","v":0},{"$f":"IFERROR(VLOOKUP($A37,Expended!$A$2:$J$198,8,FALSE),0)","v":575.95000000000005},{"$f":"IFERROR(VLOOKUP($A37,Expended!$A$2:$J$198,9,FALSE),0)","v":0},{"$f":"IFERROR(VLOOKUP($A37,Expended!$A$2:$J$198,10,FALSE),0)","v":111367.02},{"$f":"IFERROR(VLOOKUP($A37,Expended!$A$2:$L$198,11,FALSE),0)","v":43571.040000000001},{"$f":"VLOOKUP($A37,Prior!$A$1:$K$199,5,FALSE)","v":11981},{"$f":"VLOOKUP($A37,Prior!$A$1:$K$199,6,FALSE)","v":65659},{"$f":"VLOOKUP($A37,Prior!$A$1:$K$199,7,FALSE)","v":0},{"$f":"VLOOKUP($A37,Prior!$A$1:$K$199,8,FALSE)","v":256015},{"$f":"VLOOKUP($A37,Prior!$A$1:$K$199,9,FALSE)","v":0},{"$f":"VLOOKUP($A37,Prior!$A$1:$K$199,10,FALSE)","v":91044.03},{"$f":"VLOOKUP($A37,Prior!$A$1:$K$199,11,FALSE)","v":71514.89},0,0,0,0,0,258299.77,0]
[13,"COUNCIL DISTRICT",100185610,{"$f":"IFERROR(VLOOKUP($A38,Awarded!$A$2:$J$196,4,FALSE),0)","v":11058.53},{"$f":"IFERROR(VLOOKUP($A38,Awarded!$A$2:$J$196,5,FALSE),0)","v":41975.06},{"$f":"IFERROR(VLOOKUP($A38,Awarded!$A$2:$J$196,6,FALSE),0)","v":0},{"$f":"IFERROR(VLOOKUP($A38,Awarded!$A$2:$J$196,7,FALSE),0)","v":211004.63},{"$f":"IFERROR(VLOOKUP($A38,Awarded!$A$2:$J$196,8,FALSE),0)","v":0},{"$f":"IFERROR(VLOOKUP($A38,Awarded!$A$2:$J$196,9,FALSE),0)","v":378859.98},{"$f":"IFERROR(VLOOKUP($A38,Awarded!$A$2:$J$196,10,FALSE),0)","v":94639.48},{"$f":"IFERROR(VLOOKUP($A38,Expended!$A$2:$J$198,5,FALSE),0)","v":0},{"$f":"IFERROR(VLOOKUP($A38,Expended!$A$2:$J$198,6,FALSE),0)","v":0},{"$f":"IFERROR(VLOOKUP($A38,Expended!$A$2:$J$198,7,FALSE),0)","v":0},{"$f":"IFERROR(VLOOKUP($A38,Expended!$A$2:$J$198,8,FALSE),0)","v":26612.129999999997},{"$f":"IFERROR(VLOOKUP($A38,Expended!$A$2:$J$198,9,FALSE),0)","v":0},{"$f":"IFERROR(VLOOKUP($A38,Expended!$A$2:$J$198,10,FALSE),0)","v":214728.72999999998},{"$f":"IFERROR(VLOOKUP($A38,Expended!$A$2:$L$198,11,FALSE),0)","v":43177},{"$f":"VLOOKUP($A38,Prior!$A$1:$K$199,5,FALSE)","v":10669},{"$f":"VLOOKUP($A38,Prior!$A$1:$K$199,6,FALSE)","v":41932},{"$f":"VLOOKUP($A38,Prior!$A$1:$K$199,7,FALSE)","v":0},{"$f":"VLOOKUP($A38,Prior!$A$1:$K$199,8,FALSE)","v":184392.14},{"$f":"VLOOKUP($A38,Prior!$A$1:$K$199,9,FALSE)","v":0},{"$f":"VLOOKUP($A38,Prior!$A$1:$K$199,10,FALSE)","v":0},{"$f":"VLOOKUP($A38,Prior!$A$1:$K$199,11,FALSE)","v":0},389.53000000000065,43.059999999997672,0,0.35999999998603016,0,164131.25,51462.479999999996]
[342,"CULDESAC JOINT DISTRICT",92284785,{"$f":"IFERROR(VLOOKUP($A39,Awarded!$A$2:$J$196,4,FALSE),0)","v":9134},{"$f":"IFERROR(VLOOKUP($A39,Awarded!$A$2:$J$196,5,FALSE),0)","v":25141.79},{"$f":"IFERROR(VLOOKUP($A39,Awarded!$A$2:$J$196,6,FALSE),0)","v":9186.91},{"$f":"IFERROR(VLOOKUP($A39,Awarded!$A$2:$J$196,7,FALSE),0)","v":100125.75},{"$f":"IFERROR(VLOOKUP($A39,Awarded!$A$2:$J$196,8,FALSE),0)","v":125563},{"$f":"IFERROR(VLOOKUP($A39,Awarded!$A$2:$J$196,9,FALSE),0)","v":179777.3},{"$f":"IFERROR(VLOOKUP($A39,Awarded!$A$2:$J$196,10,FALSE),0)","v":44908.36},{"$f":"IFERROR(VLOOKUP($A39,Expended!$A$2:$J$198,5,FALSE),0)","v":0},{"$f":"IFERROR(VLOOKUP($A39,Expended!$A$2:$J$198,6,FALSE),0)","v":25.79},{"$f":"IFERROR(VLOOKUP($A39,Expended!$A$2:$J$198,7,FALSE),0)","v":187.91},{"$f":"IFERROR(VLOOKUP($A39,Expended!$A$2:$J$198,8,FALSE),0)","v":22527.26},{"$f":"IFERROR(VLOOKUP($A39,Expended!$A$2:$J$198,9,FALSE),0)","v":32050},{"$f":"IFERROR(VLOOKUP($A39,Expended!$A$2:$J$198,10,FALSE),0)","v":0},{"$f":"IFERROR(VLOOKUP($A39,Expended!$A$2:$L$198,11,FALSE),0)","v":37140.800000000003},{"$f":"VLOOKUP($A39,Prior!$A$1:$K$199,5,FALSE)","v":9134},{"$f":"VLOOKUP($A39,Prior!$A$1:$K$199,6,FALSE)","v":25115.999999999996},{"$f":"VLOOKUP($A39,Prior!$A$1:$K$199,7,FALSE)","v":8999},{"$f":"VLOOKUP($A39,Prior!$A$1:$K$199,8,FALSE)","v":0},{"$f":"VLOOKUP($A39,Prior!$A$1:$K$199,9,FALSE)","v":0},{"$f":"VLOOKUP($A39,Prior!$A$1:$K$199,10,FALSE)","v":0},{"$f":"VLOOKUP($A39,Prior!$A$1:$K$199,11,FALSE)","v":0},0,0,0,77598.490000000005,93513,179777.3,7767.5599999999977]
[314,"DIETRICH DISTRICT",29816998,{"$f":"IFERROR(VLOOKUP($A40,Awarded!$A$2:$J$196,4,FALSE),0)","v":10291.83},{"$f":"IFERROR(VLOOKUP($A40,Awarded!$A$2:$J$196,5,FALSE),0)","v":33717.589999999997},{"$f":"IFERROR(VLOOKUP($A40,Awarded!$A$2:$J$196,6,FALSE),0)","v":0},{"$f":"IFERROR(VLOOKUP($A40,Awarded!$A$2:$J$196,7,FALSE),0)","v":176958.21},{"$f":"IFERROR(VLOOKUP($A40,Awarded!$A$2:$J$196,8,FALSE),0)","v":0},{"$f":"IFERROR(VLOOKUP($A40,Awarded!$A$2:$J$196,9,FALSE),0)","v":317729.15000000002},{"$f":"IFERROR(VLOOKUP($A40,Awarded!$A$2:$J$196,10,FALSE),0)","v":79368.92},{"$f":"IFERROR(VLOOKUP($A40,Expended!$A$2:$J$198,5,FALSE),0)","v":122.83},{"$f":"IFERROR(VLOOKUP($A40,Expended!$A$2:$J$198,6,FALSE),0)","v":34.590000000000003},{"$f":"IFERROR(VLOOKUP($A40,Expended!$A$2:$J$198,7,FALSE),0)","v":0},{"$f":"IFERROR(VLOOKUP($A40,Expended!$A$2:$J$198,8,FALSE),0)","v":89480.24},{"$f":"IFERROR(VLOOKUP($A40,Expended!$A$2:$J$198,9,FALSE),0)","v":0},{"$f":"IFERROR(VLOOKUP($A40,Expended!$A$2:$J$198,10,FALSE),0)","v":116218.96999999999},{"$f":"IFERROR(VLOOKUP($A40,Expended!$A$2:$L$198,11,FALSE),0)","v":33990.590000000004},{"$f":"VLOOKUP($A40,Prior!$A$1:$K$199,5,FALSE)","v":10169},{"$f":"VLOOKUP($A40,Prior!$A$1:$K$199,6,FALSE)","v":33683},{"$f":"VLOOKUP($A40,Prior!$A$1:$K$199,7,FALSE)","v":0},{"$f":"VLOOKUP($A40,Prior!$A$1:$K$199,8,FALSE)","v":0},{"$f":"VLOOKUP($A40,Prior!$A$1:$K$199,9,FALSE)","v":0},{"$f":"VLOOKUP($A40,Prior!$A$1:$K$199,10,FALSE)","v":78885.03},{"$f":"VLOOKUP($A40,Prior!$A$1:$K$199,11,FALSE)","v":3365.0000000000005},0,0,0,87477.969999999987,0,122625.15000000005,42013.329999999994]
[550,"DORAL ACADEMY OF IDAHO, INC.",117165868,{"$f":"IFERROR(VLOOKUP($A41,Awarded!$A$2:$J$196,4,FALSE),0)","v":2451.06},{"$f":"IFERROR(VLOOKUP($A41,Awarded!$A$2:$J$196,5,FALSE),0)","v":0},{"$f":"IFERROR(VLOOKUP($A41,Awarded!$A$2:$J$196,6,FALSE),0)","v":19447.78},{"$f":"IFERROR(VLOOKUP($A41,Awarded!$A$2:$J$196,7,FALSE),0)","v":43863.46},{"$f":"IFERROR(VLOOKUP($A41,Awarded!$A$2:$J$196,8,FALSE),0)","v":251198},{"$f":"IFERROR(VLOOKUP($A41,Awarded!$A$2:$J$196,9,FALSE),0)","v":78759.259999999995},{"$f":"IFERROR(VLOOKUP($A41,Awarded!$A$2:$J$196,10,FALSE),0)","v":19673.169999999998},{"$f":"IFERROR(VLOOKUP($A41,Expended!$A$2:$J$198,5,FALSE),0)","v":0},{"$f":"IFERROR(VLOOKUP($A41,Expended!$A$2:$J$198,6,FALSE),0)","v":0},{"$f":"IFERROR(VLOOKUP($A41,Expended!$A$2:$J$198,7,FALSE),0)","v":19447.78},{"$f":"IFERROR(VLOOKUP($A41,Expended!$A$2:$J$198,8,FALSE),0)","v":0},{"$f":"IFERROR(VLOOKUP($A41,Expended!$A$2:$J$198,9,FALSE),0)","v":146046.69},{"$f":"IFERROR(VLOOKUP($A41,Expended!$A$2:$J$198,10,FALSE),0)","v":29749.05},{"$f":"IFERROR(VLOOKUP($A41,Expended!$A$2:$L$198,11,FALSE),0)","v":0},{"$f":"VLOOKUP($A41,Prior!$A$1:$K$199,5,FALSE)","v":2411},{"$f":"VLOOKUP($A41,Prior!$A$1:$K$199,6,FALSE)","v":0},{"$f":"VLOOKUP($A41,Prior!$A$1:$K$199,7,FALSE)","v":0},{"$f":"VLOOKUP($A41,Prior!$A$1:$K$199,8,FALSE)","v":43765},{"$f":"VLOOKUP($A41,Prior!$A$1:$K$199,9,FALSE)","v":0},{"$f":"VLOOKUP($A41,Prior!$A$1:$K$199,10,FALSE)","v":49009.310000000005},{"$f":"VLOOKUP($A41,Prior!$A$1:$K$199,11,FALSE)","v":19666},40.059999999999945,0,0,98.459999999999127,105151.31,0.89999999998690328,7.1699999999982538]
[523,"ELEVATE ACADEMY INC.",18395435,{"$f":"IFERROR(VLOOKUP($A42,Awarded!$A$2:$J$196,4,FALSE),0)","v":11146},{"$f":"IFERROR(VLOOKUP($A42,Awarded!$A$2:$J$196,5,FALSE),0)","v":66698.42},{"$f":"IFERROR(VLOOKUP($A42,Awarded!$A$2:$J$196,6,FALSE),0)","v":59774.62},{"$f":"IFERROR(VLOOKUP($A42,Awarded!$A$2:$J$196,7,FALSE),0)","v":353194.79},{"$f":"IFERROR(VLOOKUP($A42,Awarded!$A$2:$J$196,8,FALSE),0)","v":0},{"$f":"IFERROR(VLOOKUP($A42,Awarded!$A$2:$J$196,9,FALSE),0)","v":634163.79},{"$f":"IFERROR(VLOOKUP($A42,Awarded!$A$2:$J$196,10,FALSE),0)","v":158414.72},{"$f":"IFERROR(VLOOKUP($A42,Expended!$A$2:$J$198,5,FALSE),0)","v":0},{"$f":"IFERROR(VLOOKUP($A42,Expended!$A$2:$J$198,6,FALSE),0)","v":0},{"$f":"IFERROR(VLOOKUP($A42,Expended!$A$2:$J$198,7,FALSE),0)","v":59774.619999999995},{"$f":"IFERROR(VLOOKUP($A42,Expended!$A$2:$J$198,8,FALSE),0)","v":205446.71000000002},{"$f":"IFERROR(VLOOKUP($A42,Expended!$A$2:$J$198,9,FALSE),0)","v":0},{"$f":"IFERROR(VLOOKUP($A42,Expended!$A$2:$J$198,10,FALSE),0)","v":133638.41999999998},{"$f":"IFERROR(VLOOKUP($A42,Expended!$A$2:$L$198,11,FALSE),0)","v":0},{"$f":"VLOOKUP($A42,Prior!$A$1:$K$199,5,FALSE)","v":11146},{"$f":"VLOOKUP($A42,Prior!$A$1:$K$199,6,FALSE)","v":66630},{"$f":"VLOOKUP($A42,Prior!$A$1:$K$199,7,FALSE)","v":0},{"$f":"VLOOKUP($A42,Prior!$A$1:$K$199,8,FALSE)","v":147748.08000000002},{"$f":"VLOOKUP($A42,Prior!$A$1:$K$199,9,FALSE)","v":0},{"$f":"VLOOKUP($A42,Prior!$A$1:$K$199,10,FALSE)","v":0},{"$f":"VLOOKUP($A42,Prior!$A$1:$K$199,11,FALSE)","v":0},0,68.419999999998254,7.2759576141834259E-12,0,0,500525.37000000005,158414.72]
[221,"EMMETT INDEPENDENT DISTRICT",7643034,{"$f":"IFERROR(VLOOKUP($A43,Awarded!$A$2:$J$196,4,FALSE),0)","v":35522},{"$f":"IFERROR(VLOOKUP($A43,Awarded!$A$2:$J$196,5,FALSE),0)","v":508268.41},{"$f":"IFERROR(VLOOKUP($A43,Awarded!$A$2:$J$196,6,FALSE),0)","v":0},{"$f":"IFERROR(VLOOKUP($A43,Awarded!$A$2:$J$196,7,FALSE),0)","v":2042702.11},{"$f":"IFERROR(VLOOKUP($A43,Awarded!$A$2:$J$196,8,FALSE),0)","v":0},{"$f":"IFERROR(VLOOKUP($A43,Awarded!$A$2:$J$196,9,FALSE),0)","v":3667687.68},{"$f":"IFERROR(VLOOKUP($A43,Awarded!$A$2:$J$196,10,FALSE),0)","v":916192.82},{"$f":"IFERROR(VLOOKUP($A43,Expended!$A$2:$J$198,5,FALSE),0)","v":16007.880000000001},{"$f":"IFERROR(VLOOKUP($A43,Expended!$A$2:$J$198,6,FALSE),0)","v":521.41},{"$f":"IFERROR(VLOOKUP($A43,Expended!$A$2:$J$198,7,FALSE),0)","v":0},{"$f":"IFERROR(VLOOKUP($A43,Expended!$A$2:$J$198,8,FALSE),0)","v":269697.14999999997},{"$f":"IFERROR(VLOOKUP($A43,Expended!$A$2:$J$198,9,FALSE),0)","v":0},{"$f":"IFERROR(VLOOKUP($A43,Expended!$A$2:$J$198,10,FALSE),0)","v":1283364.8400000003},{"$f":"IFERROR(VLOOKUP($A43,Expended!$A$2:$L$198,11,FALSE),0)","v":294273.68},{"$f":"VLOOKUP($A43,Prior!$A$1:$K$199,5,FALSE)","v":19514.12},{"$f":"VLOOKUP($A43,Prior!$A$1:$K$199,6,FALSE)","v":507747},{"$f":"VLOOKUP($A43,Prior!$A$1:$K$199,7,FALSE)","v":0},{"$f":"VLOOKUP($A43,Prior!$A$1:$K$199,8,FALSE)","v":1773004.96},{"$f":"VLOOKUP($A43,Prior!$A$1:$K$199,9,FALSE)","v":0},{"$f":"VLOOKUP($A43,Prior!$A$1:$K$199,10,FALSE)","v":494240.49},{"$f":"VLOOKUP($A43,Prior!$A$1:$K$199,11,FALSE)","v":110730.81},0,0,0,0,0,1890082.3499999999,511188.3299999999]
[456,"FALCON RIDGE PUBLIC CHARTER SCHOOL, INC.",182860341,{"$f":"IFERROR(VLOOKUP($A44,Awarded!$A$2:$J$196,4,FALSE),0)","v":13833.45},{"$f":"IFERROR(VLOOKUP($A44,Awarded!$A$2:$J$196,5,FALSE),0)","v":24404.04},{"$f":"IFERROR(VLOOKUP($A44,Awarded!$A$2:$J$196,6,FALSE),0)","v":39094.639999999999},{"$f":"IFERROR(VLOOKUP($A44,Awarded!$A$2:$J$196,7,FALSE),0)","v":83678.83},{"$f":"IFERROR(VLOOKUP($A44,Awarded!$A$2:$J$196,8,FALSE),0)","v":162288},{"$f":"IFERROR(VLOOKUP($A44,Awarded!$A$2:$J$196,9,FALSE),0)","v":150247.09},{"$f":"IFERROR(VLOOKUP($A44,Awarded!$A$2:$J$196,10,FALSE),0)","v":37531.67},{"$f":"IFERROR(VLOOKUP($A44,Expended!$A$2:$J$198,5,FALSE),0)","v":11248.45},{"$f":"IFERROR(VLOOKUP($A44,Expended!$A$2:$J$198,6,FALSE),0)","v":25.04},{"$f":"IFERROR(VLOOKUP($A44,Expended!$A$2:$J$198,7,FALSE),0)","v":799.64},{"$f":"IFERROR(VLOOKUP($A44,Expended!$A$2:$J$198,8,FALSE),0)","v":83678.83},{"$f":"IFERROR(VLOOKUP($A44,Expended!$A$2:$J$198,9,FALSE),0)","v":12310.92},{"$f":"IFERROR(VLOOKUP($A44,Expended!$A$2:$J$198,10,FALSE),0)","v":74657.909999999989},{"$f":"IFERROR(VLOOKUP($A44,Expended!$A$2:$L$198,11,FALSE),0)","v":27527.900000000009},{"$f":"VLOOKUP($A44,Prior!$A$1:$K$199,5,FALSE)","v":2585},{"$f":"VLOOKUP($A44,Prior!$A$1:$K$199,6,FALSE)","v":24379},{"$f":"VLOOKUP($A44,Prior!$A$1:$K$199,7,FALSE)","v":38295},{"$f":"VLOOKUP($A44,Prior!$A$1:$K$199,8,FALSE)","v":0},{"$f":"VLOOKUP($A44,Prior!$A$1:$K$199,9,FALSE)","v":0},{"$f":"VLOOKUP($A44,Prior!$A$1:$K$199,10,FALSE)","v":0},{"$f":"VLOOKUP($A44,Prior!$A$1:$K$199,11,FALSE)","v":0},0,0,0,0,149977.07999999999,75589.180000000008,10003.76999999999]
[531,"FERN-WATERS PUBLIC CHARTER SCHOOL, INC.",116915742,{"$f":"IFERROR(VLOOKUP($A45,Awarded!$A$2:$J$196,4,FALSE),0)","v":8660.6899999999987},{"$f":"IFERROR(VLOOKUP($A45,Awarded!$A$2:$J$196,5,FALSE),0)","v":0},{"$f":"IFERROR(VLOOKUP($A45,Awarded!$A$2:$J$196,6,FALSE),0)","v":0},{"$f":"IFERROR(VLOOKUP($A45,Awarded!$A$2:$J$196,7,FALSE),0)","v":70299.8},{"$f":"IFERROR(VLOOKUP($A45,Awarded!$A$2:$J$196,8,FALSE),0)","v":192165},{"$f":"IFERROR(VLOOKUP($A45,Awarded!$A$2:$J$196,9,FALSE),0)","v":126223.25},{"$f":"IFERROR(VLOOKUP($A45,Awarded!$A$2:$J$196,10,FALSE),0)","v":31530.49},{"$f":"IFERROR(VLOOKUP($A45,Expended!$A$2:$J$198,5,FALSE),0)","v":394.09},{"$f":"IFERROR(VLOOKUP($A45,Expended!$A$2:$J$198,6,FALSE),0)","v":0},{"$f":"IFERROR(VLOOKUP($A45,Expended!$A$2:$J$198,7,FALSE),0)","v":0},{"$f":"IFERROR(VLOOKUP($A45,Expended!$A$2:$J$198,8,FALSE),0)","v":2490.7799999999997},{"$f":"IFERROR(VLOOKUP($A45,Expended!$A$2:$J$198,9,FALSE),0)","v":89947.189999999988},{"$f":"IFERROR(VLOOKUP($A45,Expended!$A$2:$J$198,10,FALSE),0)","v":0},{"$f":"IFERROR(VLOOKUP($A45,Expended!$A$2:$L$198,11,FALSE),0)","v":5294.9800000000005},{"$f":"VLOOKUP($A45,Prior!$A$1:$K$199,5,FALSE)","v":8230.77},{"$f":"VLOOKUP($A45,Prior!$A$1:$K$199,6,FALSE)","v":0},{"$f":"VLOOKUP($A45,Prior!$A$1:$K$199,7,FALSE)","v":0},{"$f":"VLOOKUP($A45,Prior!$A$1:$K$199,8,FALSE)","v":67809.02},{"$f":"VLOOKUP($A45,Prior!$A$1:$K$199,9,FALSE)","v":9910.8700000000008},{"$f":"VLOOKUP($A45,Prior!$A$1:$K$199,10,FALSE)","v":126076.99},{"$f":"VLOOKUP($A45,Prior!$A$1:$K$199,11,FALSE)","v":9408.36},35.829999999998108,0,0,0,92306.940000000017,146.25999999999476,16827.150000000001]
[413,"FILER DISTRICT",100014943,{"$f":"IFERROR(VLOOKUP($A46,Awarded!$A$2:$J$196,4,FALSE),0)","v":29357.08},{"$f":"IFERROR(VLOOKUP($A46,Awarded!$A$2:$J$196,5,FALSE),0)","v":205175.48},{"$f":"IFERROR(VLOOKUP($A46,Awarded!$A$2:$J$196,6,FALSE),0)","v":23990.7},{"$f":"IFERROR(VLOOKUP($A46,Awarded!$A$2:$J$196,7,FALSE),0)","v":749793.01},{"$f":"IFERROR(VLOOKUP($A46,Awarded!$A$2:$J$196,8,FALSE),0)","v":0},{"$f":"IFERROR(VLOOKUP($A46,Awarded!$A$2:$J$196,9,FALSE),0)","v":1346258.89},{"$f":"IFERROR(VLOOKUP($A46,Awarded!$A$2:$J$196,10,FALSE),0)","v":336297.53},{"$f":"IFERROR(VLOOKUP($A46,Expended!$A$2:$J$198,5,FALSE),0)","v":29357.08},{"$f":"IFERROR(VLOOKUP($A46,Expended!$A$2:$J$198,6,FALSE),0)","v":1743.13},{"$f":"IFERROR(VLOOKUP($A46,Expended!$A$2:$J$198,7,FALSE),0)","v":0},{"$f":"IFERROR(VLOOKUP($A46,Expended!$A$2:$J$198,8,FALSE),0)","v":62928.26},{"$f":"IFERROR(VLOOKUP($A46,Expended!$A$2:$J$198,9,FALSE),0)","v":0},{"$f":"IFERROR(VLOOKUP($A46,Expended!$A$2:$J$198,10,FALSE),0)","v":0},{"$f":"IFERROR(VLOOKUP($A46,Expended!$A$2:$L$198,11,FALSE),0)","v":10820.25},{"$f":"VLOOKUP($A46,Prior!$A$1:$K$199,5,FALSE)","v":0},{"$f":"VLOOKUP($A46,Prior!$A$1:$K$199,6,FALSE)","v":203432.35},{"$f":"VLOOKUP($A46,Prior!$A$1:$K$199,7,FALSE)","v":0},{"$f":"VLOOKUP($A46,Prior!$A$1:$K$199,8,FALSE)","v":0},{"$f":"VLOOKUP($A46,Prior!$A$1:$K$199,9,FALSE)","v":0},{"$f":"VLOOKUP($A46,Prior!$A$1:$K$199,10,FALSE)","v":0},{"$f":"VLOOKUP($A46,Prior!$A$1:$K$199,11,FALSE)","v":0},0,0,23990.7,686864.75,0,1346258.89,325477.28000000003]
[59,"FIRTH DISTRICT",100014950,{"$f":"IFERROR(VLOOKUP($A47,Awarded!$A$2:$J$196,4,FALSE),0)","v":17665.2},{"$f":"IFERROR(VLOOKUP($A47,Awarded!$A$2:$J$196,5,FALSE),0)","v":65504.2},{"$f":"IFERROR(VLOOKUP($A47,Awarded!$A$2:$J$196,6,FALSE),0)","v":86891.26},{"$f":"IFERROR(VLOOKUP($A47,Awarded!$A$2:$J$196,7,FALSE),0)","v":288679.98},{"$f":"IFERROR(VLOOKUP($A47,Awarded!$A$2:$J$196,8,FALSE),0)","v":0},{"$f":"IFERROR(VLOOKUP($A47,Awarded!$A$2:$J$196,9,FALSE),0)","v":518327.58},{"$f":"IFERROR(VLOOKUP($A47,Awarded!$A$2:$J$196,10,FALSE),0)","v":129479.18},{"$f":"IFERROR(VLOOKUP($A47,Expended!$A$2:$J$198,5,FALSE),0)","v":751.2},{"$f":"IFERROR(VLOOKUP($A47,Expended!$A$2:$J$198,6,FALSE),0)","v":67.2},{"$f":"IFERROR(VLOOKUP($A47,Expended!$A$2:$J$198,7,FALSE),0)","v":1777.26},{"$f":"IFERROR(VLOOKUP($A47,Expended!$A$2:$J$198,8,FALSE),0)","v":22173.5},{"$f":"IFERROR(VLOOKUP($A47,Expended!$A$2:$J$198,9,FALSE),0)","v":0},{"$f":"IFERROR(VLOOKUP($A47,Expended!$A$2:$J$198,10,FALSE),0)","v":231000},{"$f":"IFERROR(VLOOKUP($A47,Expended!$A$2:$L$198,11,FALSE),0)","v":44330.450000000004},{"$f":"VLOOKUP($A47,Prior!$A$1:$K$199,5,FALSE)","v":16914},{"$f":"VLOOKUP($A47,Prior!$A$1:$K$199,6,FALSE)","v":65437.000000000007},{"$f":"VLOOKUP($A47,Prior!$A$1:$K$199,7,FALSE)","v":85114},{"$f":"VLOOKUP($A47,Prior!$A$1:$K$199,8,FALSE)","v":179883.22},{"$f":"VLOOKUP($A47,Prior!$A$1:$K$199,9,FALSE)","v":0},{"$f":"VLOOKUP($A47,Prior!$A$1:$K$199,10,FALSE)","v":0},{"$f":"VLOOKUP($A47,Prior!$A$1:$K$199,11,FALSE)","v":32860.400000000001},0,0,0,86623.25999999998,0,287327.58,52288.32999999998]
[528,"FORGE INTERNATIONAL, LLC",116766344,{"$f":"IFERROR(VLOOKUP($A48,Awarded!$A$2:$J$196,4,FALSE),0)","v":10862.06},{"$f":"IFERROR(VLOOKUP($A48,Awarded!$A$2:$J$196,5,FALSE),0)","v":21533.09},{"$f":"IFERROR(VLOOKUP($A48,Awarded!$A$2:$J$196,6,FALSE),0)","v":47554.68},{"$f":"IFERROR(VLOOKUP($A48,Awarded!$A$2:$J$196,7,FALSE),0)","v":125358.38},{"$f":"IFERROR(VLOOKUP($A48,Awarded!$A$2:$J$196,8,FALSE),0)","v":106811},{"$f":"IFERROR(VLOOKUP($A48,Awarded!$A$2:$J$196,9,FALSE),0)","v":225080.8},{"$f":"IFERROR(VLOOKUP($A48,Awarded!$A$2:$J$196,10,FALSE),0)","v":56225.49},{"$f":"IFERROR(VLOOKUP($A48,Expended!$A$2:$J$198,5,FALSE),0)","v":323.06},{"$f":"IFERROR(VLOOKUP($A48,Expended!$A$2:$J$198,6,FALSE),0)","v":22.09},{"$f":"IFERROR(VLOOKUP($A48,Expended!$A$2:$J$198,7,FALSE),0)","v":17513.18},{"$f":"IFERROR(VLOOKUP($A48,Expended!$A$2:$J$198,8,FALSE),0)","v":19445.13},{"$f":"IFERROR(VLOOKUP($A48,Expended!$A$2:$J$198,9,FALSE),0)","v":106811},{"$f":"IFERROR(VLOOKUP($A48,Expended!$A$2:$J$198,10,FALSE),0)","v":33232.850000000006},{"$f":"IFERROR(VLOOKUP($A48,Expended!$A$2:$L$198,11,FALSE),0)","v":20.49},{"$f":"VLOOKUP($A48,Prior!$A$1:$K$199,5,FALSE)","v":10539},{"$f":"VLOOKUP($A48,Prior!$A$1:$K$199,6,FALSE)","v":21511},{"$f":"VLOOKUP($A48,Prior!$A$1:$K$199,7,FALSE)","v":30041.5},{"$f":"VLOOKUP($A48,Prior!$A$1:$K$199,8,FALSE)","v":105913.25},{"$f":"VLOOKUP($A48,Prior!$A$1:$K$199,9,FALSE)","v":0},{"$f":"VLOOKUP($A48,Prior!$A$1:$K$199,10,FALSE)","v":191847.95},{"$f":"VLOOKUP($A48,Prior!$A$1:$K$199,11,FALSE)","v":56205},0,0,0,0,0,0,0]
[215,"FREMONT COUNTY JOINT DISTRICT",184556975,{"$f":"IFERROR(VLOOKUP($A49,Awarded!$A$2:$J$196,4,FALSE),0)","v":34248.9},{"$f":"IFERROR(VLOOKUP($A49,Awarded!$A$2:$J$196,5,FALSE),0)","v":420348.22},{"$f":"IFERROR(VLOOKUP($A49,Awarded!$A$2:$J$196,6,FALSE),0)","v":0},{"$f":"IFERROR(VLOOKUP($A49,Awarded!$A$2:$J$196,7,FALSE),0)","v":1716747.47},{"$f":"IFERROR(VLOOKUP($A49,Awarded!$A$2:$J$196,8,FALSE),0)","v":0},{"$f":"IFERROR(VLOOKUP($A49,Awarded!$A$2:$J$196,9,FALSE),0)","v":3082432.56},{"$f":"IFERROR(VLOOKUP($A49,Awarded!$A$2:$J$196,10,FALSE),0)","v":769995.55},{"$f":"IFERROR(VLOOKUP($A49,Expended!$A$2:$J$198,5,FALSE),0)","v":4520},{"$f":"IFERROR(VLOOKUP($A49,Expended!$A$2:$J$198,6,FALSE),0)","v":431.22},{"$f":"IFERROR(VLOOKUP($A49,Expended!$A$2:$J$198,7,FALSE),0)","v":0},{"$f":"IFERROR(VLOOKUP($A49,Expended!$A$2:$J$198,8,FALSE),0)","v":3853.47},{"$f":"IFERROR(VLOOKUP($A49,Expended!$A$2:$J$198,9,FALSE),0)","v":0},{"$f":"IFERROR(VLOOKUP($A49,Expended!$A$2:$J$198,10,FALSE),0)","v":2576008.2499999995},{"$f":"IFERROR(VLOOKUP($A49,Expended!$A$2:$L$198,11,FALSE),0)","v":402378.96},{"$f":"VLOOKUP($A49,Prior!$A$1:$K$199,5,FALSE)","v":29728.9},{"$f":"VLOOKUP($A49,Prior!$A$1:$K$199,6,FALSE)","v":419917},{"$f":"VLOOKUP($A49,Prior!$A$1:$K$199,7,FALSE)","v":0},{"$f":"VLOOKUP($A49,Prior!$A$1:$K$199,8,FALSE)","v":1712893.9999999998},{"$f":"VLOOKUP($A49,Prior!$A$1:$K$199,9,FALSE)","v":0},{"$f":"VLOOKUP($A49,Prior!$A$1:$K$199,10,FALSE)","v":189961.16999999998},{"$f":"VLOOKUP($A49,Prior!$A$1:$K$199,11,FALSE)","v":338022.02},0,0,0,0,0,316463.14000000054,29594.570000000007]
[373,"FRUITLAND DISTRICT",100014968,{"$f":"IFERROR(VLOOKUP($A50,Awarded!$A$2:$J$196,4,FALSE),0)","v":26764.42},{"$f":"IFERROR(VLOOKUP($A50,Awarded!$A$2:$J$196,5,FALSE),0)","v":171639.08},{"$f":"IFERROR(VLOOKUP($A50,Awarded!$A$2:$J$196,6,FALSE),0)","v":85238.46},{"$f":"IFERROR(VLOOKUP($A50,Awarded!$A$2:$J$196,7,FALSE),0)","v":685949.7},{"$f":"IFERROR(VLOOKUP($A50,Awarded!$A$2:$J$196,8,FALSE),0)","v":0},{"$f":"IFERROR(VLOOKUP($A50,Awarded!$A$2:$J$196,9,FALSE),0)","v":1231627.06},{"$f":"IFERROR(VLOOKUP($A50,Awarded!$A$2:$J$196,10,FALSE),0)","v":307662.09999999998},{"$f":"IFERROR(VLOOKUP($A50,Expended!$A$2:$J$198,5,FALSE),0)","v":6367.42},{"$f":"IFERROR(VLOOKUP($A50,Expended!$A$2:$J$198,6,FALSE),0)","v":176.08},{"$f":"IFERROR(VLOOKUP($A50,Expended!$A$2:$J$198,7,FALSE),0)","v":0},{"$f":"IFERROR(VLOOKUP($A50,Expended!$A$2:$J$198,8,FALSE),0)","v":481141.24},{"$f":"IFERROR(VLOOKUP($A50,Expended!$A$2:$J$198,9,FALSE),0)","v":0},{"$f":"IFERROR(VLOOKUP($A50,Expended!$A$2:$J$198,10,FALSE),0)","v":130140.04},{"$f":"IFERROR(VLOOKUP($A50,Expended!$A$2:$L$198,11,FALSE),0)","v":41824.769999999997},{"$f":"VLOOKUP($A50,Prior!$A$1:$K$199,5,FALSE)","v":20397},{"$f":"VLOOKUP($A50,Prior!$A$1:$K$199,6,FALSE)","v":171463},{"$f":"VLOOKUP($A50,Prior!$A$1:$K$199,7,FALSE)","v":20069.3},{"$f":"VLOOKUP($A50,Prior!$A$1:$K$199,8,FALSE)","v":180161.46},{"$f":"VLOOKUP($A50,Prior!$A$1:$K$199,9,FALSE)","v":0},{"$f":"VLOOKUP($A50,Prior!$A$1:$K$199,10,FALSE)","v":700529.94},{"$f":"VLOOKUP($A50,Prior!$A$1:$K$199,11,FALSE)","v":0},0,0,65169.16,24646.999999999971,0,400957.08000000007,265837.32999999996]
[499,"FUTURE PUBLIC SCHOOL, INC.",80975896,{"$f":"IFERROR(VLOOKUP($A51,Awarded!$A$2:$J$196,4,FALSE),0)","v":11360.78},{"$f":"IFERROR(VLOOKUP($A51,Awarded!$A$2:$J$196,5,FALSE),0)","v":50575.88},{"$f":"IFERROR(VLOOKUP($A51,Awarded!$A$2:$J$196,6,FALSE),0)","v":0},{"$f":"IFERROR(VLOOKUP($A51,Awarded!$A$2:$J$196,7,FALSE),0)","v":307841.99},{"$f":"IFERROR(VLOOKUP($A51,Awarded!$A$2:$J$196,8,FALSE),0)","v":0},{"$f":"IFERROR(VLOOKUP($A51,Awarded!$A$2:$J$196,9,FALSE),0)","v":552731.43999999994},{"$f":"IFERROR(VLOOKUP($A51,Awarded!$A$2:$J$196,10,FALSE),0)","v":138073.31},{"$f":"IFERROR(VLOOKUP($A51,Expended!$A$2:$J$198,5,FALSE),0)","v":6559.78},{"$f":"IFERROR(VLOOKUP($A51,Expended!$A$2:$J$198,6,FALSE),0)","v":4745.32},{"$f":"IFERROR(VLOOKUP($A51,Expended!$A$2:$J$198,7,FALSE),0)","v":0},{"$f":"IFERROR(VLOOKUP($A51,Expended!$A$2:$J$198,8,FALSE),0)","v":179141.31},{"$f":"IFERROR(VLOOKUP($A51,Expended!$A$2:$J$198,9,FALSE),0)","v":0},{"$f":"IFERROR(VLOOKUP($A51,Expended!$A$2:$J$198,10,FALSE),0)","v":170254.19},{"$f":"IFERROR(VLOOKUP($A51,Expended!$A$2:$L$198,11,FALSE),0)","v":104248.23},{"$f":"VLOOKUP($A51,Prior!$A$1:$K$199,5,FALSE)","v":4801},{"$f":"VLOOKUP($A51,Prior!$A$1:$K$199,6,FALSE)","v":45830.559999999998},{"$f":"VLOOKUP($A51,Prior!$A$1:$K$199,7,FALSE)","v":0},{"$f":"VLOOKUP($A51,Prior!$A$1:$K$199,8,FALSE)","v":128700.68},{"$f":"VLOOKUP($A51,Prior!$A$1:$K$199,9,FALSE)","v":0},{"$f":"VLOOKUP($A51,Prior!$A$1:$K$199,10,FALSE)","v":0},{"$f":"VLOOKUP($A51,Prior!$A$1:$K$199,11,FALSE)","v":0},0,0,0,0,0,382477.24999999994,33825.08]
[71,"GARDEN VALLEY DISTRICT",29632296,{"$f":"IFERROR(VLOOKUP($A52,Awarded!$A$2:$J$196,4,FALSE),0)","v":11149.21},{"$f":"IFERROR(VLOOKUP($A52,Awarded!$A$2:$J$196,5,FALSE),0)","v":81644.759999999995},{"$f":"IFERROR(VLOOKUP($A52,Awarded!$A$2:$J$196,6,FALSE),0)","v":0},{"$f":"IFERROR(VLOOKUP($A52,Awarded!$A$2:$J$196,7,FALSE),0)","v":296463.45},{"$f":"IFERROR(VLOOKUP($A52,Awarded!$A$2:$J$196,8,FALSE),0)","v":0},{"$f":"IFERROR(VLOOKUP($A52,Awarded!$A$2:$J$196,9,FALSE),0)","v":532302.77},{"$f":"IFERROR(VLOOKUP($A52,Awarded!$A$2:$J$196,10,FALSE),0)","v":132969.45000000001},{"$f":"IFERROR(VLOOKUP($A52,Expended!$A$2:$J$198,5,FALSE),0)","v":0},{"$f":"IFERROR(VLOOKUP($A52,Expended!$A$2:$J$198,6,FALSE),0)","v":0},{"$f":"IFERROR(VLOOKUP($A52,Expended!$A$2:$J$198,7,FALSE),0)","v":0},{"$f":"IFERROR(VLOOKUP($A52,Expended!$A$2:$J$198,8,FALSE),0)","v":74635.12},{"$f":"IFERROR(VLOOKUP($A52,Expended!$A$2:$J$198,9,FALSE),0)","v":0},{"$f":"IFERROR(VLOOKUP($A52,Expended!$A$2:$J$198,10,FALSE),0)","v":210886.75},{"$f":"IFERROR(VLOOKUP($A52,Expended!$A$2:$L$198,11,FALSE),0)","v":74541.77},{"$f":"VLOOKUP($A52,Prior!$A$1:$K$199,5,FALSE)","v":11019},{"$f":"VLOOKUP($A52,Prior!$A$1:$K$199,6,FALSE)","v":81561},{"$f":"VLOOKUP($A52,Prior!$A$1:$K$199,7,FALSE)","v":0},{"$f":"VLOOKUP($A52,Prior!$A$1:$K$199,8,FALSE)","v":169069.65},{"$f":"VLOOKUP($A52,Prior!$A$1:$K$199,9,FALSE)","v":0},{"$f":"VLOOKUP($A52,Prior!$A$1:$K$199,10,FALSE)","v":317887.14},{"$f":"VLOOKUP($A52,Prior!$A$1:$K$199,11,FALSE)","v":46085.03},130.20999999999913,83.759999999994761,0,52758.680000000022,0,3528.8800000000047,12342.650000000009]
[549,"GEM PREP: MERIDIAN NORTH, LLC",117200585,{"$f":"IFERROR(VLOOKUP($A53,Awarded!$A$2:$J$196,4,FALSE),0)","v":0},{"$f":"IFERROR(VLOOKUP($A53,Awarded!$A$2:$J$196,5,FALSE),0)","v":0},{"$f":"IFERROR(VLOOKUP($A53,Awarded!$A$2:$J$196,6,FALSE),0)","v":0},{"$f":"IFERROR(VLOOKUP($A53,Awarded!$A$2:$J$196,7,FALSE),0)","v":66716.75},{"$f":"IFERROR(VLOOKUP($A53,Awarded!$A$2:$J$196,8,FALSE),0)","v":65381},{"$f":"IFERROR(VLOOKUP($A53,Awarded!$A$2:$J$196,9,FALSE),0)","v":119790.8},{"$f":"IFERROR(VLOOKUP($A53,Awarded!$A$2:$J$196,10,FALSE),0)","v":29923.9},{"$f":"IFERROR(VLOOKUP($A53,Expended!$A$2:$J$198,5,FALSE),0)","v":0},{"$f":"IFERROR(VLOOKUP($A53,Expended!$A$2:$J$198,6,FALSE),0)","v":0},{"$f":"IFERROR(VLOOKUP($A53,Expended!$A$2:$J$198,7,FALSE),0)","v":0},{"$f":"IFERROR(VLOOKUP($A53,Expended!$A$2:$J$198,8,FALSE),0)","v":149.75},{"$f":"IFERROR(VLOOKUP($A53,Expended!$A$2:$J$198,9,FALSE),0)","v":0},{"$f":"IFERROR(VLOOKUP($A53,Expended!$A$2:$J$198,10,FALSE),0)","v":10690.84},{"$f":"IFERROR(VLOOKUP($A53,Expended!$A$2:$L$198,11,FALSE),0)","v":3957.51},{"$f":"VLOOKUP($A53,Prior!$A$1:$K$199,5,FALSE)","v":0},{"$f":"VLOOKUP($A53,Prior!$A$1:$K$199,6,FALSE)","v":0},{"$f":"VLOOKUP($A53,Prior!$A$1:$K$199,7,FALSE)","v":0},{"$f":"VLOOKUP($A53,Prior!$A$1:$K$199,8,FALSE)","v":66567},{"$f":"VLOOKUP($A53,Prior!$A$1:$K$199,9,FALSE)","v":65381},{"$f":"VLOOKUP($A53,Prior!$A$1:$K$199,10,FALSE)","v":109099.96},{"$f":"VLOOKUP($A53,Prior!$A$1:$K$199,11,FALSE)","v":15368.07},0,0,0,0,0,0,10598.32]
[498,"GEM PREP: MERIDIAN, LLC",81046990,{"$f":"IFERROR(VLOOKUP($A54,Awarded!$A$2:$J$196,4,FALSE),0)","v":12283.65},{"$f":"IFERROR(VLOOKUP($A54,Awarded!$A$2:$J$196,5,FALSE),0)","v":58410.92},{"$f":"IFERROR(VLOOKUP($A54,Awarded!$A$2:$J$196,6,FALSE),0)","v":0},{"$f":"IFERROR(VLOOKUP($A54,Awarded!$A$2:$J$196,7,FALSE),0)","v":254663.63},{"$f":"IFERROR(VLOOKUP($A54,Awarded!$A$2:$J$196,8,FALSE),0)","v":0},{"$f":"IFERROR(VLOOKUP($A54,Awarded!$A$2:$J$196,9,FALSE),0)","v":457249.81},{"$f":"IFERROR(VLOOKUP($A54,Awarded!$A$2:$J$196,10,FALSE),0)","v":114221.62},{"$f":"IFERROR(VLOOKUP($A54,Expended!$A$2:$J$198,5,FALSE),0)","v":387.64},{"$f":"IFERROR(VLOOKUP($A54,Expended!$A$2:$J$198,6,FALSE),0)","v":0},{"$f":"IFERROR(VLOOKUP($A54,Expended!$A$2:$J$198,7,FALSE),0)","v":0},{"$f":"IFERROR(VLOOKUP($A54,Expended!$A$2:$J$198,8,FALSE),0)","v":27954.54},{"$f":"IFERROR(VLOOKUP($A54,Expended!$A$2:$J$198,9,FALSE),0)","v":0},{"$f":"IFERROR(VLOOKUP($A54,Expended!$A$2:$J$198,10,FALSE),0)","v":19834.3},{"$f":"IFERROR(VLOOKUP($A54,Expended!$A$2:$L$198,11,FALSE),0)","v":47871.46},{"$f":"VLOOKUP($A54,Prior!$A$1:$K$199,5,FALSE)","v":11849},{"$f":"VLOOKUP($A54,Prior!$A$1:$K$199,6,FALSE)","v":58351},{"$f":"VLOOKUP($A54,Prior!$A$1:$K$199,7,FALSE)","v":0},{"$f":"VLOOKUP($A54,Prior!$A$1:$K$199,8,FALSE)","v":226709.09},{"$f":"VLOOKUP($A54,Prior!$A$1:$K$199,9,FALSE)","v":0},{"$f":"VLOOKUP($A54,Prior!$A$1:$K$199,10,FALSE)","v":256212.35},{"$f":"VLOOKUP($A54,Prior!$A$1:$K$199,11,FALSE)","v":10139.050000000001},47.010000000000218,59.919999999998254,0,0,0,181203.16,56211.11]
[796,"GEM PREP: NAMPA, LLC",81304980,{"$f":"IFERROR(VLOOKUP($A55,Awarded!$A$2:$J$196,4,FALSE),0)","v":12937.509999999998},{"$f":"IFERROR(VLOOKUP($A55,Awarded!$A$2:$J$196,5,FALSE),0)","v":0},{"$f":"IFERROR(VLOOKUP($A55,Awarded!$A$2:$J$196,6,FALSE),0)","v":149104.76999999999},{"$f":"IFERROR(VLOOKUP($A55,Awarded!$A$2:$J$196,7,FALSE),0)","v":292348.21000000002},{"$f":"IFERROR(VLOOKUP($A55,Awarded!$A$2:$J$196,8,FALSE),0)","v":0},{"$f":"IFERROR(VLOOKUP($A55,Awarded!$A$2:$J$196,9,FALSE),0)","v":524913.21},{"$f":"IFERROR(VLOOKUP($A55,Awarded!$A$2:$J$196,10,FALSE),0)","v":131123.78},{"$f":"IFERROR(VLOOKUP($A55,Expended!$A$2:$J$198,5,FALSE),0)","v":461.82},{"$f":"IFERROR(VLOOKUP($A55,Expended!$A$2:$J$198,6,FALSE),0)","v":0},{"$f":"IFERROR(VLOOKUP($A55,Expended!$A$2:$J$198,7,FALSE),0)","v":3049.77},{"$f":"IFERROR(VLOOKUP($A55,Expended!$A$2:$J$198,8,FALSE),0)","v":233917.22999999998},{"$f":"IFERROR(VLOOKUP($A55,Expended!$A$2:$J$198,9,FALSE),0)","v":0},{"$f":"IFERROR(VLOOKUP($A55,Expended!$A$2:$J$198,10,FALSE),0)","v":1853.63},{"$f":"IFERROR(VLOOKUP($A55,Expended!$A$2:$L$198,11,FALSE),0)","v":71084.17},{"$f":"VLOOKUP($A55,Prior!$A$1:$K$199,5,FALSE)","v":12452.64},{"$f":"VLOOKUP($A55,Prior!$A$1:$K$199,6,FALSE)","v":0},{"$f":"VLOOKUP($A55,Prior!$A$1:$K$199,7,FALSE)","v":146055},{"$f":"VLOOKUP($A55,Prior!$A$1:$K$199,8,FALSE)","v":58430.979999999996},{"$f":"VLOOKUP($A55,Prior!$A$1:$K$199,9,FALSE)","v":0},{"$f":"VLOOKUP($A55,Prior!$A$1:$K$199,10,FALSE)","v":316704.26},{"$f":"VLOOKUP($A55,Prior!$A$1:$K$199,11,FALSE)","v":12501.45},23.049999999999272,0,0,0,0,206355.31999999995,47538.16]
[534,"GEM PREP: ONLINE LLC",117035032,{"$f":"IFERROR(VLOOKUP($A56,Awarded!$A$2:$J$196,4,FALSE),0)","v":11643.890000000001},{"$f":"IFERROR(VLOOKUP($A56,Awarded!$A$2:$J$196,5,FALSE),0)","v":99144.71},{"$f":"IFERROR(VLOOKUP($A56,Awarded!$A$2:$J$196,6,FALSE),0)","v":0},{"$f":"IFERROR(VLOOKUP($A56,Awarded!$A$2:$J$196,7,FALSE),0)","v":339968.1},{"$f":"IFERROR(VLOOKUP($A56,Awarded!$A$2:$J$196,8,FALSE),0)","v":0},{"$f":"IFERROR(VLOOKUP($A56,Awarded!$A$2:$J$196,9,FALSE),0)","v":610415.28},{"$f":"IFERROR(VLOOKUP($A56,Awarded!$A$2:$J$196,10,FALSE),0)","v":152482.56},{"$f":"IFERROR(VLOOKUP($A56,Expended!$A$2:$J$198,5,FALSE),0)","v":365.79},{"$f":"IFERROR(VLOOKUP($A56,Expended!$A$2:$J$198,6,FALSE),0)","v":101.71},{"$f":"IFERROR(VLOOKUP($A56,Expended!$A$2:$J$198,7,FALSE),0)","v":0},{"$f":"IFERROR(VLOOKUP($A56,Expended!$A$2:$J$198,8,FALSE),0)","v":110782.38},{"$f":"IFERROR(VLOOKUP($A56,Expended!$A$2:$J$198,9,FALSE),0)","v":0},{"$f":"IFERROR(VLOOKUP($A56,Expended!$A$2:$J$198,10,FALSE),0)","v":14.94},{"$f":"IFERROR(VLOOKUP($A56,Expended!$A$2:$L$198,11,FALSE),0)","v":52102.28},{"$f":"VLOOKUP($A56,Prior!$A$1:$K$199,5,FALSE)","v":11151.47},{"$f":"VLOOKUP($A56,Prior!$A$1:$K$199,6,FALSE)","v":99043},{"$f":"VLOOKUP($A56,Prior!$A$1:$K$199,7,FALSE)","v":0},{"$f":"VLOOKUP($A56,Prior!$A$1:$K$199,8,FALSE)","v":229185.72},{"$f":"VLOOKUP($A56,Prior!$A$1:$K$199,9,FALSE)","v":0},{"$f":"VLOOKUP($A56,Prior!$A$1:$K$199,10,FALSE)","v":609445},{"$f":"VLOOKUP($A56,Prior!$A$1:$K$199,11,FALSE)","v":16217.039999999999},126.63000000000102,0,0,0,0,955.34000000008382,84163.24]
[496,"GEM PREP: POCATELLO, LLC",80511840,{"$f":"IFERROR(VLOOKUP($A57,Awarded!$A$2:$J$196,4,FALSE),0)","v":11598.55},{"$f":"IFERROR(VLOOKUP($A57,Awarded!$A$2:$J$196,5,FALSE),0)","v":55297.73},{"$f":"IFERROR(VLOOKUP($A57,Awarded!$A$2:$J$196,6,FALSE),0)","v":0},{"$f":"IFERROR(VLOOKUP($A57,Awarded!$A$2:$J$196,7,FALSE),0)","v":436314.36},{"$f":"IFERROR(VLOOKUP($A57,Awarded!$A$2:$J$196,8,FALSE),0)","v":0},{"$f":"IFERROR(VLOOKUP($A57,Awarded!$A$2:$J$196,9,FALSE),0)","v":783406.72},{"$f":"IFERROR(VLOOKUP($A57,Awarded!$A$2:$J$196,10,FALSE),0)","v":195696.3},{"$f":"IFERROR(VLOOKUP($A57,Expended!$A$2:$J$198,5,FALSE),0)","v":408.51},{"$f":"IFERROR(VLOOKUP($A57,Expended!$A$2:$J$198,6,FALSE),0)","v":56.73},{"$f":"IFERROR(VLOOKUP($A57,Expended!$A$2:$J$198,7,FALSE),0)","v":0},{"$f":"IFERROR(VLOOKUP($A57,Expended!$A$2:$J$198,8,FALSE),0)","v":190172.93000000002},{"$f":"IFERROR(VLOOKUP($A57,Expended!$A$2:$J$198,9,FALSE),0)","v":0},{"$f":"IFERROR(VLOOKUP($A57,Expended!$A$2:$J$198,10,FALSE),0)","v":3435.56},{"$f":"IFERROR(VLOOKUP($A57,Expended!$A$2:$L$198,11,FALSE),0)","v":67603.670000000013},{"$f":"VLOOKUP($A57,Prior!$A$1:$K$199,5,FALSE)","v":10944.61},{"$f":"VLOOKUP($A57,Prior!$A$1:$K$199,6,FALSE)","v":55241},{"$f":"VLOOKUP($A57,Prior!$A$1:$K$199,7,FALSE)","v":0},{"$f":"VLOOKUP($A57,Prior!$A$1:$K$199,8,FALSE)","v":246141.43},{"$f":"VLOOKUP($A57,Prior!$A$1:$K$199,9,FALSE)","v":0},{"$f":"VLOOKUP($A57,Prior!$A$1:$K$199,10,FALSE)","v":351760.15},{"$f":"VLOOKUP($A57,Prior!$A$1:$K$199,11,FALSE)","v":9048.07},245.42999999999847,0,0,0,0,428211.00999999989,119044.55999999997]
[282,"GENESEE JOINT DISTRICT",100185818,{"$f":"IFERROR(VLOOKUP($A58,Awarded!$A$2:$J$196,4,FALSE),0)","v":11609.64},{"$f":"IFERROR(VLOOKUP($A58,Awarded!$A$2:$J$196,5,FALSE),0)","v":36538.480000000003},{"$f":"IFERROR(VLOOKUP($A58,Awarded!$A$2:$J$196,6,FALSE),0)","v":32848.89},{"$f":"IFERROR(VLOOKUP($A58,Awarded!$A$2:$J$196,7,FALSE),0)","v":129026.62},{"$f":"IFERROR(VLOOKUP($A58,Awarded!$A$2:$J$196,8,FALSE),0)","v":61029},{"$f":"IFERROR(VLOOKUP($A58,Awarded!$A$2:$J$196,9,FALSE),0)","v":231667.43},{"$f":"IFERROR(VLOOKUP($A58,Awarded!$A$2:$J$196,10,FALSE),0)","v":57871.09},{"$f":"IFERROR(VLOOKUP($A58,Expended!$A$2:$J$198,5,FALSE),0)","v":0},{"$f":"IFERROR(VLOOKUP($A58,Expended!$A$2:$J$198,6,FALSE),0)","v":0},{"$f":"IFERROR(VLOOKUP($A58,Expended!$A$2:$J$198,7,FALSE),0)","v":32848.89},{"$f":"IFERROR(VLOOKUP($A58,Expended!$A$2:$J$198,8,FALSE),0)","v":3653.81},{"$f":"IFERROR(VLOOKUP($A58,Expended!$A$2:$J$198,9,FALSE),0)","v":60278.65},{"$f":"IFERROR(VLOOKUP($A58,Expended!$A$2:$J$198,10,FALSE),0)","v":0},{"$f":"IFERROR(VLOOKUP($A58,Expended!$A$2:$L$198,11,FALSE),0)","v":0},{"$f":"VLOOKUP($A58,Prior!$A$1:$K$199,5,FALSE)","v":11200},{"$f":"VLOOKUP($A58,Prior!$A$1:$K$199,6,FALSE)","v":36501},{"$f":"VLOOKUP($A58,Prior!$A$1:$K$199,7,FALSE)","v":0},{"$f":"VLOOKUP($A58,Prior!$A$1:$K$199,8,FALSE)","v":125372.81},{"$f":"VLOOKUP($A58,Prior!$A$1:$K$199,9,FALSE)","v":0},{"$f":"VLOOKUP($A58,Prior!$A$1:$K$199,10,FALSE)","v":0},{"$f":"VLOOKUP($A58,Prior!$A$1:$K$199,11,FALSE)","v":0},409.63999999999942,37.480000000003201,0,0,750.34999999999854,231667.43,57871.09]
[192,"GLENS FERRY JOINT DISTRICT",605581743,{"$f":"IFERROR(VLOOKUP($A59,Awarded!$A$2:$J$196,4,FALSE),0)","v":2918.7},{"$f":"IFERROR(VLOOKUP($A59,Awarded!$A$2:$J$196,5,FALSE),0)","v":96142.63},{"$f":"IFERROR(VLOOKUP($A59,Awarded!$A$2:$J$196,6,FALSE),0)","v":0},{"$f":"IFERROR(VLOOKUP($A59,Awarded!$A$2:$J$196,7,FALSE),0)","v":523162.31},{"$f":"IFERROR(VLOOKUP($A59,Awarded!$A$2:$J$196,8,FALSE),0)","v":0},{"$f":"IFERROR(VLOOKUP($A59,Awarded!$A$2:$J$196,9,FALSE),0)","v":939342.4},{"$f":"IFERROR(VLOOKUP($A59,Awarded!$A$2:$J$196,10,FALSE),0)","v":234648.5},{"$f":"IFERROR(VLOOKUP($A59,Expended!$A$2:$J$198,5,FALSE),0)","v":0},{"$f":"IFERROR(VLOOKUP($A59,Expended!$A$2:$J$198,6,FALSE),0)","v":0},{"$f":"IFERROR(VLOOKUP($A59,Expended!$A$2:$J$198,7,FALSE),0)","v":0},{"$f":"IFERROR(VLOOKUP($A59,Expended!$A$2:$J$198,8,FALSE),0)","v":102775.85},{"$f":"IFERROR(VLOOKUP($A59,Expended!$A$2:$J$198,9,FALSE),0)","v":0},{"$f":"IFERROR(VLOOKUP($A59,Expended!$A$2:$J$198,10,FALSE),0)","v":183243.49},{"$f":"IFERROR(VLOOKUP($A59,Expended!$A$2:$L$198,11,FALSE),0)","v":92690.58},{"$f":"VLOOKUP($A59,Prior!$A$1:$K$199,5,FALSE)","v":0},{"$f":"VLOOKUP($A59,Prior!$A$1:$K$199,6,FALSE)","v":96044},{"$f":"VLOOKUP($A59,Prior!$A$1:$K$199,7,FALSE)","v":0},{"$f":"VLOOKUP($A59,Prior!$A$1:$K$199,8,FALSE)","v":274333.86},{"$f":"VLOOKUP($A59,Prior!$A$1:$K$199,9,FALSE)","v":0},{"$f":"VLOOKUP($A59,Prior!$A$1:$K$199,10,FALSE)","v":216105.5},{"$f":"VLOOKUP($A59,Prior!$A$1:$K$199,11,FALSE)","v":132320.58000000002},2918.7,98.630000000004657,0,146052.59999999998,0,539993.41,9637.3399999999674]
[231,"GOODING JOINT DISTRICT",29720992,{"$f":"IFERROR(VLOOKUP($A60,Awarded!$A$2:$J$196,4,FALSE),0)","v":11511.04},{"$f":"IFERROR(VLOOKUP($A60,Awarded!$A$2:$J$196,5,FALSE),0)","v":234046.1},{"$f":"IFERROR(VLOOKUP($A60,Awarded!$A$2:$J$196,6,FALSE),0)","v":0},{"$f":"IFERROR(VLOOKUP($A60,Awarded!$A$2:$J$196,7,FALSE),0)","v":921900.33},{"$f":"IFERROR(VLOOKUP($A60,Awarded!$A$2:$J$196,8,FALSE),0)","v":0},{"$f":"IFERROR(VLOOKUP($A60,Awarded!$A$2:$J$196,9,FALSE),0)","v":1655277.94},{"$f":"IFERROR(VLOOKUP($A60,Awarded!$A$2:$J$196,10,FALSE),0)","v":413490.66},{"$f":"IFERROR(VLOOKUP($A60,Expended!$A$2:$J$198,5,FALSE),0)","v":0},{"$f":"IFERROR(VLOOKUP($A60,Expended!$A$2:$J$198,6,FALSE),0)","v":0},{"$f":"IFERROR(VLOOKUP($A60,Expended!$A$2:$J$198,7,FALSE),0)","v":0},{"$f":"IFERROR(VLOOKUP($A60,Expended!$A$2:$J$198,8,FALSE),0)","v":51210.64},{"$f":"IFERROR(VLOOKUP($A60,Expended!$A$2:$J$198,9,FALSE),0)","v":0},{"$f":"IFERROR(VLOOKUP($A60,Expended!$A$2:$J$198,10,FALSE),0)","v":462640.82},{"$f":"IFERROR(VLOOKUP($A60,Expended!$A$2:$L$198,11,FALSE),0)","v":159100.69},{"$f":"VLOOKUP($A60,Prior!$A$1:$K$199,5,FALSE)","v":11511.039999999999},{"$f":"VLOOKUP($A60,Prior!$A$1:$K$199,6,FALSE)","v":233806},{"$f":"VLOOKUP($A60,Prior!$A$1:$K$199,7,FALSE)","v":0},{"$f":"VLOOKUP($A60,Prior!$A$1:$K$199,8,FALSE)","v":811617.49},{"$f":"VLOOKUP($A60,Prior!$A$1:$K$199,9,FALSE)","v":0},{"$f":"VLOOKUP($A60,Prior!$A$1:$K$199,10,FALSE)","v":300571.71999999997},{"$f":"VLOOKUP($A60,Prior!$A$1:$K$199,11,FALSE)","v":51639.229999999996},0,240.10000000000582,0,59072.199999999953,0,892065.39999999991,202750.74]
[148,"GRACE JOINT DISTRICT",29651205,{"$f":"IFERROR(VLOOKUP($A61,Awarded!$A$2:$J$196,4,FALSE),0)","v":16992.059999999998},{"$f":"IFERROR(VLOOKUP($A61,Awarded!$A$2:$J$196,5,FALSE),0)","v":52304.66},{"$f":"IFERROR(VLOOKUP($A61,Awarded!$A$2:$J$196,6,FALSE),0)","v":60597.45},{"$f":"IFERROR(VLOOKUP($A61,Awarded!$A$2:$J$196,7,FALSE),0)","v":209034.2},{"$f":"IFERROR(VLOOKUP($A61,Awarded!$A$2:$J$196,8,FALSE),0)","v":0},{"$f":"IFERROR(VLOOKUP($A61,Awarded!$A$2:$J$196,9,FALSE),0)","v":375321.88},{"$f":"IFERROR(VLOOKUP($A61,Awarded!$A$2:$J$196,10,FALSE),0)","v":93756.160000000003},{"$f":"IFERROR(VLOOKUP($A61,Expended!$A$2:$J$198,5,FALSE),0)","v":16992.059999999998},{"$f":"IFERROR(VLOOKUP($A61,Expended!$A$2:$J$198,6,FALSE),0)","v":53.66},{"$f":"IFERROR(VLOOKUP($A61,Expended!$A$2:$J$198,7,FALSE),0)","v":0},{"$f":"IFERROR(VLOOKUP($A61,Expended!$A$2:$J$198,8,FALSE),0)","v":0},{"$f":"IFERROR(VLOOKUP($A61,Expended!$A$2:$J$198,9,FALSE),0)","v":0},{"$f":"IFERROR(VLOOKUP($A61,Expended!$A$2:$J$198,10,FALSE),0)","v":25129.21},{"$f":"IFERROR(VLOOKUP($A61,Expended!$A$2:$L$198,11,FALSE),0)","v":11338.21},{"$f":"VLOOKUP($A61,Prior!$A$1:$K$199,5,FALSE)","v":0},{"$f":"VLOOKUP($A61,Prior!$A$1:$K$199,6,FALSE)","v":52251},{"$f":"VLOOKUP($A61,Prior!$A$1:$K$199,7,FALSE)","v":59358},{"$f":"VLOOKUP($A61,Prior!$A$1:$K$199,8,FALSE)","v":208565},{"$f":"VLOOKUP($A61,Prior!$A$1:$K$199,9,FALSE)","v":0},{"$f":"VLOOKUP($A61,Prior!$A$1:$K$199,10,FALSE)","v":0},{"$f":"VLOOKUP($A61,Prior!$A$1:$K$199,11,FALSE)","v":0},0,0,1239.4499999999971,469.20000000001164,0,350192.67,82417.950000000012]
[233,"HAGERMAN JOINT DISTRICT",193089125,{"$f":"IFERROR(VLOOKUP($A62,Awarded!$A$2:$J$196,4,FALSE),0)","v":11367},{"$f":"IFERROR(VLOOKUP($A62,Awarded!$A$2:$J$196,5,FALSE),0)","v":61579.17},{"$f":"IFERROR(VLOOKUP($A62,Awarded!$A$2:$J$196,6,FALSE),0)","v":0},{"$f":"IFERROR(VLOOKUP($A62,Awarded!$A$2:$J$196,7,FALSE),0)","v":276673.03000000003},{"$f":"IFERROR(VLOOKUP($A62,Awarded!$A$2:$J$196,8,FALSE),0)","v":0},{"$f":"IFERROR(VLOOKUP($A62,Awarded!$A$2:$J$196,9,FALSE),0)","v":496769.6},{"$f":"IFERROR(VLOOKUP($A62,Awarded!$A$2:$J$196,10,FALSE),0)","v":124093.21},{"$f":"IFERROR(VLOOKUP($A62,Expended!$A$2:$J$198,5,FALSE),0)","v":318},{"$f":"IFERROR(VLOOKUP($A62,Expended!$A$2:$J$198,6,FALSE),0)","v":63.17},{"$f":"IFERROR(VLOOKUP($A62,Expended!$A$2:$J$198,7,FALSE),0)","v":0},{"$f":"IFERROR(VLOOKUP($A62,Expended!$A$2:$J$198,8,FALSE),0)","v":52801.57},{"$f":"IFERROR(VLOOKUP($A62,Expended!$A$2:$J$198,9,FALSE),0)","v":0},{"$f":"IFERROR(VLOOKUP($A62,Expended!$A$2:$J$198,10,FALSE),0)","v":45043.320000000007},{"$f":"IFERROR(VLOOKUP($A62,Expended!$A$2:$L$198,11,FALSE),0)","v":26713.23},{"$f":"VLOOKUP($A62,Prior!$A$1:$K$199,5,FALSE)","v":11049},{"$f":"VLOOKUP($A62,Prior!$A$1:$K$199,6,FALSE)","v":61516},{"$f":"VLOOKUP($A62,Prior!$A$1:$K$199,7,FALSE)","v":0},{"$f":"VLOOKUP($A62,Prior!$A$1:$K$199,8,FALSE)","v":223871.46000000002},{"$f":"VLOOKUP($A62,Prior!$A$1:$K$199,9,FALSE)","v":0},{"$f":"VLOOKUP($A62,Prior!$A$1:$K$199,10,FALSE)","v":36013},{"$f":"VLOOKUP($A62,Prior!$A$1:$K$199,11,FALSE)","v":79703.41},0,0,0,0,0,415713.27999999997,17676.570000000007]
[415,"HANSEN DISTRICT",100015015,{"$f":"IFERROR(VLOOKUP($A63,Awarded!$A$2:$J$196,4,FALSE),0)","v":11955.98},{"$f":"IFERROR(VLOOKUP($A63,Awarded!$A$2:$J$196,5,FALSE),0)","v":81002.100000000006},{"$f":"IFERROR(VLOOKUP($A63,Awarded!$A$2:$J$196,6,FALSE),0)","v":0},{"$f":"IFERROR(VLOOKUP($A63,Awarded!$A$2:$J$196,7,FALSE),0)","v":305356.40999999997},{"$f":"IFERROR(VLOOKUP($A63,Awarded!$A$2:$J$196,8,FALSE),0)","v":0},{"$f":"IFERROR(VLOOKUP($A63,Awarded!$A$2:$J$196,9,FALSE),0)","v":548270.27},{"$f":"IFERROR(VLOOKUP($A63,Awarded!$A$2:$J$196,10,FALSE),0)","v":136958.9},{"$f":"IFERROR(VLOOKUP($A63,Expended!$A$2:$J$198,5,FALSE),0)","v":9265.9800000000014},{"$f":"IFERROR(VLOOKUP($A63,Expended!$A$2:$J$198,6,FALSE),0)","v":83.1},{"$f":"IFERROR(VLOOKUP($A63,Expended!$A$2:$J$198,7,FALSE),0)","v":0},{"$f":"IFERROR(VLOOKUP($A63,Expended!$A$2:$J$198,8,FALSE),0)","v":170795.45},{"$f":"IFERROR(VLOOKUP($A63,Expended!$A$2:$J$198,9,FALSE),0)","v":0},{"$f":"IFERROR(VLOOKUP($A63,Expended!$A$2:$J$198,10,FALSE),0)","v":86026.359999999971},{"$f":"IFERROR(VLOOKUP($A63,Expended!$A$2:$L$198,11,FALSE),0)","v":56159.37},{"$f":"VLOOKUP($A63,Prior!$A$1:$K$199,5,FALSE)","v":2690},{"$f":"VLOOKUP($A63,Prior!$A$1:$K$199,6,FALSE)","v":80919},{"$f":"VLOOKUP($A63,Prior!$A$1:$K$199,7,FALSE)","v":0},{"$f":"VLOOKUP($A63,Prior!$A$1:$K$199,8,FALSE)","v":40245.15},{"$f":"VLOOKUP($A63,Prior!$A$1:$K$199,9,FALSE)","v":0},{"$f":"VLOOKUP($A63,Prior!$A$1:$K$199,10,FALSE)","v":557.78},{"$f":"VLOOKUP($A63,Prior!$A$1:$K$199,11,FALSE)","v":80799.53},0,0,0,94315.809999999969,0,461686.13,0]
[508,"HAYDEN CANYON CHARTER SCHOOL, INC.",80998762,{"$f":"IFERROR(VLOOKUP($A64,Awarded!$A$2:$J$196,4,FALSE),0)","v":11545.18},{"$f":"IFERROR(VLOOKUP($A64,Awarded!$A$2:$J$196,5,FALSE),0)","v":16069.49},{"$f":"IFERROR(VLOOKUP($A64,Awarded!$A$2:$J$196,6,FALSE),0)","v":24469.5},{"$f":"IFERROR(VLOOKUP($A64,Awarded!$A$2:$J$196,7,FALSE),0)","v":91541.48},{"$f":"IFERROR(VLOOKUP($A64,Awarded!$A$2:$J$196,8,FALSE),0)","v":144732},{"$f":"IFERROR(VLOOKUP($A64,Awarded!$A$2:$J$196,9,FALSE),0)","v":164363.44},{"$f":"IFERROR(VLOOKUP($A64,Awarded!$A$2:$J$196,10,FALSE),0)","v":41057.96},{"$f":"IFERROR(VLOOKUP($A64,Expended!$A$2:$J$198,5,FALSE),0)","v":189.18},{"$f":"IFERROR(VLOOKUP($A64,Expended!$A$2:$J$198,6,FALSE),0)","v":16.489999999999998},{"$f":"IFERROR(VLOOKUP($A64,Expended!$A$2:$J$198,7,FALSE),0)","v":0},{"$f":"IFERROR(VLOOKUP($A64,Expended!$A$2:$J$198,8,FALSE),0)","v":205.48},{"$f":"IFERROR(VLOOKUP($A64,Expended!$A$2:$J$198,9,FALSE),0)","v":0},{"$f":"IFERROR(VLOOKUP($A64,Expended!$A$2:$J$198,10,FALSE),0)","v":0},{"$f":"IFERROR(VLOOKUP($A64,Expended!$A$2:$L$198,11,FALSE),0)","v":0},{"$f":"VLOOKUP($A64,Prior!$A$1:$K$199,5,FALSE)","v":11356},{"$f":"VLOOKUP($A64,Prior!$A$1:$K$199,6,FALSE)","v":16053},{"$f":"VLOOKUP($A64,Prior!$A$1:$K$199,7,FALSE)","v":23969},{"$f":"VLOOKUP($A64,Prior!$A$1:$K$199,8,FALSE)","v":91336},{"$f":"VLOOKUP($A64,Prior!$A$1:$K$199,9,FALSE)","v":0},{"$f":"VLOOKUP($A64,Prior!$A$1:$K$199,10,FALSE)","v":0},{"$f":"VLOOKUP($A64,Prior!$A$1:$K$199,11,FALSE)","v":0},0,0,500.5,0,144732,164363.44,41057.96]
[479,"HERITAGE ACADEMY, INC.",69071435,{"$f":"IFERROR(VLOOKUP($A65,Awarded!$A$2:$J$196,4,FALSE),0)","v":9438.48},{"$f":"IFERROR(VLOOKUP($A65,Awarded!$A$2:$J$196,5,FALSE),0)","v":45294.47},{"$f":"IFERROR(VLOOKUP($A65,Awarded!$A$2:$J$196,6,FALSE),0)","v":0},{"$f":"IFERROR(VLOOKUP($A65,Awarded!$A$2:$J$196,7,FALSE),0)","v":168856.02},{"$f":"IFERROR(VLOOKUP($A65,Awarded!$A$2:$J$196,8,FALSE),0)","v":0},{"$f":"IFERROR(VLOOKUP($A65,Awarded!$A$2:$J$196,9,FALSE),0)","v":303182.28999999998},{"$f":"IFERROR(VLOOKUP($A65,Awarded!$A$2:$J$196,10,FALSE),0)","v":75735.59},{"$f":"IFERROR(VLOOKUP($A65,Expended!$A$2:$J$198,5,FALSE),0)","v":330.48},{"$f":"IFERROR(VLOOKUP($A65,Expended!$A$2:$J$198,6,FALSE),0)","v":46.47},{"$f":"IFERROR(VLOOKUP($A65,Expended!$A$2:$J$198,7,FALSE),0)","v":0},{"$f":"IFERROR(VLOOKUP($A65,Expended!$A$2:$J$198,8,FALSE),0)","v":927.31},{"$f":"IFERROR(VLOOKUP($A65,Expended!$A$2:$J$198,9,FALSE),0)","v":0},{"$f":"IFERROR(VLOOKUP($A65,Expended!$A$2:$J$198,10,FALSE),0)","v":89161.249999999985},{"$f":"IFERROR(VLOOKUP($A65,Expended!$A$2:$L$198,11,FALSE),0)","v":32909.64},{"$f":"VLOOKUP($A65,Prior!$A$1:$K$199,5,FALSE)","v":9108},{"$f":"VLOOKUP($A65,Prior!$A$1:$K$199,6,FALSE)","v":45248},{"$f":"VLOOKUP($A65,Prior!$A$1:$K$199,7,FALSE)","v":0},{"$f":"VLOOKUP($A65,Prior!$A$1:$K$199,8,FALSE)","v":167928.71000000002},{"$f":"VLOOKUP($A65,Prior!$A$1:$K$199,9,FALSE)","v":0},{"$f":"VLOOKUP($A65,Prior!$A$1:$K$199,10,FALSE)","v":185209.92},{"$f":"VLOOKUP($A65,Prior!$A$1:$K$199,11,FALSE)","v":42825.95},0,0,0,0,0,28811.119999999966,0]
[481,"HERITAGE COMMUNITY CHARTER SCHOOL, INC.",58025766,{"$f":"IFERROR(VLOOKUP($A66,Awarded!$A$2:$J$196,4,FALSE),0)","v":13432.2},{"$f":"IFERROR(VLOOKUP($A66,Awarded!$A$2:$J$196,5,FALSE),0)","v":101831.46},{"$f":"IFERROR(VLOOKUP($A66,Awarded!$A$2:$J$196,6,FALSE),0)","v":0},{"$f":"IFERROR(VLOOKUP($A66,Awarded!$A$2:$J$196,7,FALSE),0)","v":406964.49},{"$f":"IFERROR(VLOOKUP($A66,Awarded!$A$2:$J$196,8,FALSE),0)","v":0},{"$f":"IFERROR(VLOOKUP($A66,Awarded!$A$2:$J$196,9,FALSE),0)","v":730706.66},{"$f":"IFERROR(VLOOKUP($A66,Awarded!$A$2:$J$196,10,FALSE),0)","v":182531.51},{"$f":"IFERROR(VLOOKUP($A66,Expended!$A$2:$J$198,5,FALSE),0)","v":10485.200000000001},{"$f":"IFERROR(VLOOKUP($A66,Expended!$A$2:$J$198,6,FALSE),0)","v":104.46},{"$f":"IFERROR(VLOOKUP($A66,Expended!$A$2:$J$198,7,FALSE),0)","v":0},{"$f":"IFERROR(VLOOKUP($A66,Expended!$A$2:$J$198,8,FALSE),0)","v":16863.89},{"$f":"IFERROR(VLOOKUP($A66,Expended!$A$2:$J$198,9,FALSE),0)","v":0},{"$f":"IFERROR(VLOOKUP($A66,Expended!$A$2:$J$198,10,FALSE),0)","v":190147.41},{"$f":"IFERROR(VLOOKUP($A66,Expended!$A$2:$L$198,11,FALSE),0)","v":182531.50999999998},{"$f":"VLOOKUP($A66,Prior!$A$1:$K$199,5,FALSE)","v":2947},{"$f":"VLOOKUP($A66,Prior!$A$1:$K$199,6,FALSE)","v":101727},{"$f":"VLOOKUP($A66,Prior!$A$1:$K$199,7,FALSE)","v":0},{"$f":"VLOOKUP($A66,Prior!$A$1:$K$199,8,FALSE)","v":322187.11},{"$f":"VLOOKUP($A66,Prior!$A$1:$K$199,9,FALSE)","v":0},{"$f":"VLOOKUP($A66,Prior!$A$1:$K$199,10,FALSE)","v":0},{"$f":"VLOOKUP($A66,Prior!$A$1:$K$199,11,FALSE)","v":0},0,0,0,67913.489999999991,0,540559.25,2.9103830456733704E-11]
[305,"HIGHLAND JOINT DISTRICT",193083409,{"$f":"IFERROR(VLOOKUP($A67,Awarded!$A$2:$J$196,4,FALSE),0)","v":2588.84},{"$f":"IFERROR(VLOOKUP($A67,Awarded!$A$2:$J$196,5,FALSE),0)","v":28647.39},{"$f":"IFERROR(VLOOKUP($A67,Awarded!$A$2:$J$196,6,FALSE),0)","v":14693.54},{"$f":"IFERROR(VLOOKUP($A67,Awarded!$A$2:$J$196,7,FALSE),0)","v":104405.35},{"$f":"IFERROR(VLOOKUP($A67,Awarded!$A$2:$J$196,8,FALSE),0)","v":116008},{"$f":"IFERROR(VLOOKUP($A67,Awarded!$A$2:$J$196,9,FALSE),0)","v":187460.21},{"$f":"IFERROR(VLOOKUP($A67,Awarded!$A$2:$J$196,10,FALSE),0)","v":46828.06},{"$f":"IFERROR(VLOOKUP($A67,Expended!$A$2:$J$198,5,FALSE),0)","v":1824.1},{"$f":"IFERROR(VLOOKUP($A67,Expended!$A$2:$J$198,6,FALSE),0)","v":29.39},{"$f":"IFERROR(VLOOKUP($A67,Expended!$A$2:$J$198,7,FALSE),0)","v":14693.54},{"$f":"IFERROR(VLOOKUP($A67,Expended!$A$2:$J$198,8,FALSE),0)","v":48553.630000000005},{"$f":"IFERROR(VLOOKUP($A67,Expended!$A$2:$J$198,9,FALSE),0)","v":0},{"$f":"IFERROR(VLOOKUP($A67,Expended!$A$2:$J$198,10,FALSE),0)","v":112905.75},{"$f":"IFERROR(VLOOKUP($A67,Expended!$A$2:$L$198,11,FALSE),0)","v":9733.06},{"$f":"VLOOKUP($A67,Prior!$A$1:$K$199,5,FALSE)","v":764.74},{"$f":"VLOOKUP($A67,Prior!$A$1:$K$199,6,FALSE)","v":28618},{"$f":"VLOOKUP($A67,Prior!$A$1:$K$199,7,FALSE)","v":0},{"$f":"VLOOKUP($A67,Prior!$A$1:$K$199,8,FALSE)","v":55851.72},{"$f":"VLOOKUP($A67,Prior!$A$1:$K$199,9,FALSE)","v":0},{"$f":"VLOOKUP($A67,Prior!$A$1:$K$199,10,FALSE)","v":0},{"$f":"VLOOKUP($A67,Prior!$A$1:$K$199,11,FALSE)","v":0},{"$f":"D67-K67-R67","v":0},{"$f":"E67-L67-S67","v":0},{"$f":"F67-M67-T67","v":0},{"$f":"G67-N67-U67","v":0},{"$f":"H67-O67-V67","v":116008},{"$f":"I67-P67-W67","v":74554.459999999992},{"$f":"J67-Q67-X67","v":37095}]
[370,"HOMEDALE JOINT DISTRICT",100186048,{"$f":"IFERROR(VLOOKUP($A68,Awarded!$A$2:$J$196,4,FALSE),0)","v":21792.41},{"$f":"IFERROR(VLOOKUP($A68,Awarded!$A$2:$J$196,5,FALSE),0)","v":242004.26},{"$f":"IFERROR(VLOOKUP($A68,Awarded!$A$2:$J$196,6,FALSE),0)","v":0},{"$f":"IFERROR(VLOOKUP($A68,Awarded!$A$2:$J$196,7,FALSE),0)","v":908868.07},{"$f":"IFERROR(VLOOKUP($A68,Awarded!$A$2:$J$196,8,FALSE),0)","v":0},{"$f":"IFERROR(VLOOKUP($A68,Awarded!$A$2:$J$196,9,FALSE),0)","v":1631880.83},{"$f":"IFERROR(VLOOKUP($A68,Awarded!$A$2:$J$196,10,FALSE),0)","v":407645.53},{"$f":"IFERROR(VLOOKUP($A68,Expended!$A$2:$J$198,5,FALSE),0)","v":781.41},{"$f":"IFERROR(VLOOKUP($A68,Expended!$A$2:$J$198,6,FALSE),0)","v":248.26},{"$f":"IFERROR(VLOOKUP($A68,Expended!$A$2:$J$198,7,FALSE),0)","v":0},{"$f":"IFERROR(VLOOKUP($A68,Expended!$A$2:$J$198,8,FALSE),0)","v":73980.01999999999},{"$f":"IFERROR(VLOOKUP($A68,Expended!$A$2:$J$198,9,FALSE),0)","v":0},{"$f":"IFERROR(VLOOKUP($A68,Expended!$A$2:$J$198,10,FALSE),0)","v":55244.85},{"$f":"IFERROR(VLOOKUP($A68,Expended!$A$2:$L$198,11,FALSE),0)","v":268770},{"$f":"VLOOKUP($A68,Prior!$A$1:$K$199,5,FALSE)","v":21011},{"$f":"VLOOKUP($A68,Prior!$A$1:$K$199,6,FALSE)","v":241756},{"$f":"VLOOKUP($A68,Prior!$A$1:$K$199,7,FALSE)","v":0},{"$f":"VLOOKUP($A68,Prior!$A$1:$K$199,8,FALSE)","v":0},{"$f":"VLOOKUP($A68,Prior!$A$1:$K$199,9,FALSE)","v":0},{"$f":"VLOOKUP($A68,Prior!$A$1:$K$199,10,FALSE)","v":94980.02},{"$f":"VLOOKUP($A68,Prior!$A$1:$K$199,11,FALSE)","v":78765.37},0,0,0,834888.04999999993,0,1481655.96,60110.160000000033]
[73,"HORSESHOE BEND SCHOOL DISTRICT",949307193,{"$f":"IFERROR(VLOOKUP($A69,Awarded!$A$2:$J$196,4,FALSE),0)","v":2718.18},{"$f":"IFERROR(VLOOKUP($A69,Awarded!$A$2:$J$196,5,FALSE),0)","v":41712.79},{"$f":"IFERROR(VLOOKUP($A69,Awarded!$A$2:$J$196,6,FALSE),0)","v":0},{"$f":"IFERROR(VLOOKUP($A69,Awarded!$A$2:$J$196,7,FALSE),0)","v":166705.19},{"$f":"IFERROR(VLOOKUP($A69,Awarded!$A$2:$J$196,8,FALSE),0)","v":0},{"$f":"IFERROR(VLOOKUP($A69,Awarded!$A$2:$J$196,9,FALSE),0)","v":299319.82},{"$f":"IFERROR(VLOOKUP($A69,Awarded!$A$2:$J$196,10,FALSE),0)","v":74770.240000000005},{"$f":"IFERROR(VLOOKUP($A69,Expended!$A$2:$J$198,5,FALSE),0)","v":189.18},{"$f":"IFERROR(VLOOKUP($A69,Expended!$A$2:$J$198,6,FALSE),0)","v":42.79},{"$f":"IFERROR(VLOOKUP($A69,Expended!$A$2:$J$198,7,FALSE),0)","v":0},{"$f":"IFERROR(VLOOKUP($A69,Expended!$A$2:$J$198,8,FALSE),0)","v":374.19},{"$f":"IFERROR(VLOOKUP($A69,Expended!$A$2:$J$198,9,FALSE),0)","v":0},{"$f":"IFERROR(VLOOKUP($A69,Expended!$A$2:$J$198,10,FALSE),0)","v":193281.05},{"$f":"IFERROR(VLOOKUP($A69,Expended!$A$2:$L$198,11,FALSE),0)","v":48471.09},{"$f":"VLOOKUP($A69,Prior!$A$1:$K$199,5,FALSE)","v":2529},{"$f":"VLOOKUP($A69,Prior!$A$1:$K$199,6,FALSE)","v":41670.000000000007},{"$f":"VLOOKUP($A69,Prior!$A$1:$K$199,7,FALSE)","v":0},{"$f":"VLOOKUP($A69,Prior!$A$1:$K$199,8,FALSE)","v":166331},{"$f":"VLOOKUP($A69,Prior!$A$1:$K$199,9,FALSE)","v":0},{"$f":"VLOOKUP($A69,Prior!$A$1:$K$199,10,FALSE)","v":67107.73000000001},{"$f":"VLOOKUP($A69,Prior!$A$1:$K$199,11,FALSE)","v":26299.149999999998},0,0,0,0,0,38931.040000000008,0]
[795,"IDAHO ARTS CHARTER SCHOOL, INC.",191501993,{"$f":"IFERROR(VLOOKUP($A70,Awarded!$A$2:$J$196,4,FALSE),0)","v":4595.74},{"$f":"IFERROR(VLOOKUP($A70,Awarded!$A$2:$J$196,5,FALSE),0)","v":0},{"$f":"IFERROR(VLOOKUP($A70,Awarded!$A$2:$J$196,6,FALSE),0)","v":404118.79},{"$f":"IFERROR(VLOOKUP($A70,Awarded!$A$2:$J$196,7,FALSE),0)","v":569979.39},{"$f":"IFERROR(VLOOKUP($A70,Awarded!$A$2:$J$196,8,FALSE),0)","v":0},{"$f":"IFERROR(VLOOKUP($A70,Awarded!$A$2:$J$196,9,FALSE),0)","v":1023401.8},{"$f":"IFERROR(VLOOKUP($A70,Awarded!$A$2:$J$196,10,FALSE),0)","v":255647.15},{"$f":"IFERROR(VLOOKUP($A70,Expended!$A$2:$J$198,5,FALSE),0)","v":40},{"$f":"IFERROR(VLOOKUP($A70,Expended!$A$2:$J$198,6,FALSE),0)","v":0},{"$f":"IFERROR(VLOOKUP($A70,Expended!$A$2:$J$198,7,FALSE),0)","v":0},{"$f":"IFERROR(VLOOKUP($A70,Expended!$A$2:$J$198,8,FALSE),0)","v":3448.35},{"$f":"IFERROR(VLOOKUP($A70,Expended!$A$2:$J$198,9,FALSE),0)","v":0},{"$f":"IFERROR(VLOOKUP($A70,Expended!$A$2:$J$198,10,FALSE),0)","v":791487.31},{"$f":"IFERROR(VLOOKUP($A70,Expended!$A$2:$L$198,11,FALSE),0)","v":255647.14999999997},{"$f":"VLOOKUP($A70,Prior!$A$1:$K$199,5,FALSE)","v":4520},{"$f":"VLOOKUP($A70,Prior!$A$1:$K$199,6,FALSE)","v":0},{"$f":"VLOOKUP($A70,Prior!$A$1:$K$199,7,FALSE)","v":395853},{"$f":"VLOOKUP($A70,Prior!$A$1:$K$199,8,FALSE)","v":565251.65},{"$f":"VLOOKUP($A70,Prior!$A$1:$K$199,9,FALSE)","v":0},{"$f":"VLOOKUP($A70,Prior!$A$1:$K$199,10,FALSE)","v":0},{"$f":"VLOOKUP($A70,Prior!$A$1:$K$199,11,FALSE)","v":0},35.739999999999782,0,8265.789999999979,1279.390000000014,0,231914.49,2.9103830456733704E-11]
[596,"IDAHO BUREAU OF EDUCATIONAL SERVICES FOR THE DEAF AND THE BLIND",78569416,{"$f":"IFERROR(VLOOKUP($A71,Awarded!$A$2:$J$196,4,FALSE),0)","v":9076.7799999999988},{"$f":"IFERROR(VLOOKUP($A71,Awarded!$A$2:$J$196,5,FALSE),0)","v":0},{"$f":"IFERROR(VLOOKUP($A71,Awarded!$A$2:$J$196,6,FALSE),0)","v":0},{"$f":"IFERROR(VLOOKUP($A71,Awarded!$A$2:$J$196,7,FALSE),0)","v":0},{"$f":"IFERROR(VLOOKUP($A71,Awarded!$A$2:$J$196,8,FALSE),0)","v":590000},{"$f":"IFERROR(VLOOKUP($A71,Awarded!$A$2:$J$196,9,FALSE),0)","v":0},{"$f":"IFERROR(VLOOKUP($A71,Awarded!$A$2:$J$196,10,FALSE),0)","v":0},{"$f":"IFERROR(VLOOKUP($A71,Expended!$A$2:$J$198,5,FALSE),0)","v":2681.28},{"$f":"IFERROR(VLOOKUP($A71,Expended!$A$2:$J$198,6,FALSE),0)","v":0},{"$f":"IFERROR(VLOOKUP($A71,Expended!$A$2:$J$198,7,FALSE),0)","v":0},{"$f":"IFERROR(VLOOKUP($A71,Expended!$A$2:$J$198,8,FALSE),0)","v":0},{"$f":"IFERROR(VLOOKUP($A71,Expended!$A$2:$J$198,9,FALSE),0)","v":11872},{"$f":"IFERROR(VLOOKUP($A71,Expended!$A$2:$J$198,10,FALSE),0)","v":0},{"$f":"IFERROR(VLOOKUP($A71,Expended!$A$2:$L$198,11,FALSE),0)","v":0},{"$f":"VLOOKUP($A71,Prior!$A$1:$K$199,5,FALSE)","v":6395.5},{"$f":"VLOOKUP($A71,Prior!$A$1:$K$199,6,FALSE)","v":0},{"$f":"VLOOKUP($A71,Prior!$A$1:$K$199,7,FALSE)","v":0},{"$f":"VLOOKUP($A71,Prior!$A$1:$K$199,8,FALSE)","v":0},{"$f":"VLOOKUP($A71,Prior!$A$1:$K$199,9,FALSE)","v":0},{"$f":"VLOOKUP($A71,Prior!$A$1:$K$199,10,FALSE)","v":0},{"$f":"VLOOKUP($A71,Prior!$A$1:$K$199,11,FALSE)","v":0},0,0,0,0,578128,0,0]
[489,"IDAHO COLLEGE AND CAREER READINESS ACADEMY, INC.",79255786,{"$f":"IFERROR(VLOOKUP($A72,Awarded!$A$2:$J$196,4,FALSE),0)","v":9737},{"$f":"IFERROR(VLOOKUP($A72,Awarded!$A$2:$J$196,5,FALSE),0)","v":0},{"$f":"IFERROR(VLOOKUP($A72,Awarded!$A$2:$J$196,6,FALSE),0)","v":118353.79},{"$f":"IFERROR(VLOOKUP($A72,Awarded!$A$2:$J$196,7,FALSE),0)","v":0},{"$f":"IFERROR(VLOOKUP($A72,Awarded!$A$2:$J$196,8,FALSE),0)","v":349143},{"$f":"IFERROR(VLOOKUP($A72,Awarded!$A$2:$J$196,9,FALSE),0)","v":0},{"$f":"IFERROR(VLOOKUP($A72,Awarded!$A$2:$J$196,10,FALSE),0)","v":0},{"$f":"IFERROR(VLOOKUP($A72,Expended!$A$2:$J$198,5,FALSE),0)","v":0},{"$f":"IFERROR(VLOOKUP($A72,Expended!$A$2:$J$198,6,FALSE),0)","v":0},{"$f":"IFERROR(VLOOKUP($A72,Expended!$A$2:$J$198,7,FALSE),0)","v":2420.79},{"$f":"IFERROR(VLOOKUP($A72,Expended!$A$2:$J$198,8,FALSE),0)","v":0},{"$f":"IFERROR(VLOOKUP($A72,Expended!$A$2:$J$198,9,FALSE),0)","v":166692.6},{"$f":"IFERROR(VLOOKUP($A72,Expended!$A$2:$J$198,10,FALSE),0)","v":0},{"$f":"IFERROR(VLOOKUP($A72,Expended!$A$2:$L$198,11,FALSE),0)","v":0},{"$f":"VLOOKUP($A72,Prior!$A$1:$K$199,5,FALSE)","v":9737},{"$f":"VLOOKUP($A72,Prior!$A$1:$K$199,6,FALSE)","v":0},{"$f":"VLOOKUP($A72,Prior!$A$1:$K$199,7,FALSE)","v":115933},{"$f":"VLOOKUP($A72,Prior!$A$1:$K$199,8,FALSE)","v":0},{"$f":"VLOOKUP($A72,Prior!$A$1:$K$199,9,FALSE)","v":160489.18},{"$f":"VLOOKUP($A72,Prior!$A$1:$K$199,10,FALSE)","v":0},{"$f":"VLOOKUP($A72,Prior!$A$1:$K$199,11,FALSE)","v":0},0,0,0,0,21961.22,0,0]
[91,"IDAHO FALLS DISTRICT",29642717,{"$f":"IFERROR(VLOOKUP($A73,Awarded!$A$2:$J$196,4,FALSE),0)","v":123603.08},{"$f":"IFERROR(VLOOKUP($A73,Awarded!$A$2:$J$196,5,FALSE),0)","v":1655222.02},{"$f":"IFERROR(VLOOKUP($A73,Awarded!$A$2:$J$196,6,FALSE),0)","v":0},{"$f":"IFERROR(VLOOKUP($A73,Awarded!$A$2:$J$196,7,FALSE),0)","v":6615025.29},{"$f":"IFERROR(VLOOKUP($A73,Awarded!$A$2:$J$196,8,FALSE),0)","v":0},{"$f":"IFERROR(VLOOKUP($A73,Awarded!$A$2:$J$196,9,FALSE),0)","v":11877328.039999999},{"$f":"IFERROR(VLOOKUP($A73,Awarded!$A$2:$J$196,10,FALSE),0)","v":2966973.04},{"$f":"IFERROR(VLOOKUP($A73,Expended!$A$2:$J$198,5,FALSE),0)","v":4495.08},{"$f":"IFERROR(VLOOKUP($A73,Expended!$A$2:$J$198,6,FALSE),0)","v":1698.02},{"$f":"IFERROR(VLOOKUP($A73,Expended!$A$2:$J$198,7,FALSE),0)","v":0},{"$f":"IFERROR(VLOOKUP($A73,Expended!$A$2:$J$198,8,FALSE),0)","v":3803432.4399999995},{"$f":"IFERROR(VLOOKUP($A73,Expended!$A$2:$J$198,9,FALSE),0)","v":0},{"$f":"IFERROR(VLOOKUP($A73,Expended!$A$2:$J$198,10,FALSE),0)","v":4790160.24},{"$f":"IFERROR(VLOOKUP($A73,Expended!$A$2:$L$198,11,FALSE),0)","v":2011064.65},{"$f":"VLOOKUP($A73,Prior!$A$1:$K$199,5,FALSE)","v":119108},{"$f":"VLOOKUP($A73,Prior!$A$1:$K$199,6,FALSE)","v":1653524},{"$f":"VLOOKUP($A73,Prior!$A$1:$K$199,7,FALSE)","v":0},{"$f":"VLOOKUP($A73,Prior!$A$1:$K$199,8,FALSE)","v":1146322.6599999999},{"$f":"VLOOKUP($A73,Prior!$A$1:$K$199,9,FALSE)","v":0},{"$f":"VLOOKUP($A73,Prior!$A$1:$K$199,10,FALSE)","v":1943036.25},{"$f":"VLOOKUP($A73,Prior!$A$1:$K$199,11,FALSE)","v":0},0,0,0,1665270.1900000006,0,5144131.5499999989,955908.39000000013]
[468,"IDAHO SCIENCE AND TECHNOLOGY CHARTER SCHOOL, INC.",826960853,{"$f":"IFERROR(VLOOKUP($A74,Awarded!$A$2:$J$196,4,FALSE),0)","v":14541.18},{"$f":"IFERROR(VLOOKUP($A74,Awarded!$A$2:$J$196,5,FALSE),0)","v":43489.61},{"$f":"IFERROR(VLOOKUP($A74,Awarded!$A$2:$J$196,6,FALSE),0)","v":0},{"$f":"IFERROR(VLOOKUP($A74,Awarded!$A$2:$J$196,7,FALSE),0)","v":245996.17},{"$f":"IFERROR(VLOOKUP($A74,Awarded!$A$2:$J$196,8,FALSE),0)","v":0},{"$f":"IFERROR(VLOOKUP($A74,Awarded!$A$2:$J$196,9,FALSE),0)","v":441688.78},{"$f":"IFERROR(VLOOKUP($A74,Awarded!$A$2:$J$196,10,FALSE),0)","v":110334.2},{"$f":"IFERROR(VLOOKUP($A74,Expended!$A$2:$J$198,5,FALSE),0)","v":2795.18},{"$f":"IFERROR(VLOOKUP($A74,Expended!$A$2:$J$198,6,FALSE),0)","v":44.61},{"$f":"IFERROR(VLOOKUP($A74,Expended!$A$2:$J$198,7,FALSE),0)","v":0},{"$f":"IFERROR(VLOOKUP($A74,Expended!$A$2:$J$198,8,FALSE),0)","v":552.16999999999996},{"$f":"IFERROR(VLOOKUP($A74,Expended!$A$2:$J$198,9,FALSE),0)","v":0},{"$f":"IFERROR(VLOOKUP($A74,Expended!$A$2:$J$198,10,FALSE),0)","v":300511.78000000003},{"$f":"IFERROR(VLOOKUP($A74,Expended!$A$2:$L$198,11,FALSE),0)","v":40.200000000000003},{"$f":"VLOOKUP($A74,Prior!$A$1:$K$199,5,FALSE)","v":11746},{"$f":"VLOOKUP($A74,Prior!$A$1:$K$199,6,FALSE)","v":43445},{"$f":"VLOOKUP($A74,Prior!$A$1:$K$199,7,FALSE)","v":0},{"$f":"VLOOKUP($A74,Prior!$A$1:$K$199,8,FALSE)","v":245444},{"$f":"VLOOKUP($A74,Prior!$A$1:$K$199,9,FALSE)","v":0},{"$f":"VLOOKUP($A74,Prior!$A$1:$K$199,10,FALSE)","v":141177},{"$f":"VLOOKUP($A74,Prior!$A$1:$K$199,11,FALSE)","v":110294},0,0,0,0,0,0,0]
[485,"IDAHO STEM ACADEMY, INC.",78455129,{"$f":"IFERROR(VLOOKUP($A75,Awarded!$A$2:$J$196,4,FALSE),0)","v":9508.1},{"$f":"IFERROR(VLOOKUP($A75,Awarded!$A$2:$J$196,5,FALSE),0)","v":17464.919999999998},{"$f":"IFERROR(VLOOKUP($A75,Awarded!$A$2:$J$196,6,FALSE),0)","v":8218.09},{"$f":"IFERROR(VLOOKUP($A75,Awarded!$A$2:$J$196,7,FALSE),0)","v":69797.67},{"$f":"IFERROR(VLOOKUP($A75,Awarded!$A$2:$J$196,8,FALSE),0)","v":193287},{"$f":"IFERROR(VLOOKUP($A75,Awarded!$A$2:$J$196,9,FALSE),0)","v":125321.21},{"$f":"IFERROR(VLOOKUP($A75,Awarded!$A$2:$J$196,10,FALSE),0)","v":31305.41},{"$f":"IFERROR(VLOOKUP($A75,Expended!$A$2:$J$198,5,FALSE),0)","v":9508.1},{"$f":"IFERROR(VLOOKUP($A75,Expended!$A$2:$J$198,6,FALSE),0)","v":17.920000000000002},{"$f":"IFERROR(VLOOKUP($A75,Expended!$A$2:$J$198,7,FALSE),0)","v":0},{"$f":"IFERROR(VLOOKUP($A75,Expended!$A$2:$J$198,8,FALSE),0)","v":26579.07},{"$f":"IFERROR(VLOOKUP($A75,Expended!$A$2:$J$198,9,FALSE),0)","v":167013.77000000002},{"$f":"IFERROR(VLOOKUP($A75,Expended!$A$2:$J$198,10,FALSE),0)","v":0},{"$f":"IFERROR(VLOOKUP($A75,Expended!$A$2:$L$198,11,FALSE),0)","v":14472.67},{"$f":"VLOOKUP($A75,Prior!$A$1:$K$199,5,FALSE)","v":0},{"$f":"VLOOKUP($A75,Prior!$A$1:$K$199,6,FALSE)","v":17447},{"$f":"VLOOKUP($A75,Prior!$A$1:$K$199,7,FALSE)","v":0},{"$f":"VLOOKUP($A75,Prior!$A$1:$K$199,8,FALSE)","v":43218.6},{"$f":"VLOOKUP($A75,Prior!$A$1:$K$199,9,FALSE)","v":0},{"$f":"VLOOKUP($A75,Prior!$A$1:$K$199,10,FALSE)","v":98717.94},{"$f":"VLOOKUP($A75,Prior!$A$1:$K$199,11,FALSE)","v":3174},0,0,8218.09,0,26273.229999999981,26603.270000000004,13658.739999999998]
[452,"IDAHO VIRTUAL ACADEMY, INC.",793722781,{"$f":"IFERROR(VLOOKUP($A76,Awarded!$A$2:$J$196,4,FALSE),0)","v":27347},{"$f":"IFERROR(VLOOKUP($A76,Awarded!$A$2:$J$196,5,FALSE),0)","v":437174.48},{"$f":"IFERROR(VLOOKUP($A76,Awarded!$A$2:$J$196,6,FALSE),0)","v":15790.99},{"$f":"IFERROR(VLOOKUP($A76,Awarded!$A$2:$J$196,7,FALSE),0)","v":1704487.95},{"$f":"IFERROR(VLOOKUP($A76,Awarded!$A$2:$J$196,8,FALSE),0)","v":0},{"$f":"IFERROR(VLOOKUP($A76,Awarded!$A$2:$J$196,9,FALSE),0)","v":3060421.05},{"$f":"IFERROR(VLOOKUP($A76,Awarded!$A$2:$J$196,10,FALSE),0)","v":764497.55},{"$f":"IFERROR(VLOOKUP($A76,Expended!$A$2:$J$198,5,FALSE),0)","v":786},{"$f":"IFERROR(VLOOKUP($A76,Expended!$A$2:$J$198,6,FALSE),0)","v":448.48},{"$f":"IFERROR(VLOOKUP($A76,Expended!$A$2:$J$198,7,FALSE),0)","v":322.99},{"$f":"IFERROR(VLOOKUP($A76,Expended!$A$2:$J$198,8,FALSE),0)","v":311428.21000000002},{"$f":"IFERROR(VLOOKUP($A76,Expended!$A$2:$J$198,9,FALSE),0)","v":0},{"$f":"IFERROR(VLOOKUP($A76,Expended!$A$2:$J$198,10,FALSE),0)","v":2411365.2400000002},{"$f":"IFERROR(VLOOKUP($A76,Expended!$A$2:$L$198,11,FALSE),0)","v":366974.89999999997},{"$f":"VLOOKUP($A76,Prior!$A$1:$K$199,5,FALSE)","v":26561},{"$f":"VLOOKUP($A76,Prior!$A$1:$K$199,6,FALSE)","v":436726},{"$f":"VLOOKUP($A76,Prior!$A$1:$K$199,7,FALSE)","v":5233959.3499999996},{"$f":"VLOOKUP($A76,Prior!$A$1:$K$199,8,FALSE)","v":1393059.74},{"$f":"VLOOKUP($A76,Prior!$A$1:$K$199,9,FALSE)","v":0},{"$f":"VLOOKUP($A76,Prior!$A$1:$K$199,10,FALSE)","v":338978.52},{"$f":"VLOOKUP($A76,Prior!$A$1:$K$199,11,FALSE)","v":397522.65},0,0,-5218491.3499999996,0,0,310077.28999999957,0]
[469,"IDAHO VIRTUAL EDUCATION PARTNERS, INC.",832251305,{"$f":"IFERROR(VLOOKUP($A77,Awarded!$A$2:$J$196,4,FALSE),0)","v":10743.189999999999},{"$f":"IFERROR(VLOOKUP($A77,Awarded!$A$2:$J$196,5,FALSE),0)","v":0},{"$f":"IFERROR(VLOOKUP($A77,Awarded!$A$2:$J$196,6,FALSE),0)","v":157865.97},{"$f":"IFERROR(VLOOKUP($A77,Awarded!$A$2:$J$196,7,FALSE),0)","v":0},{"$f":"IFERROR(VLOOKUP($A77,Awarded!$A$2:$J$196,8,FALSE),0)","v":349143},{"$f":"IFERROR(VLOOKUP($A77,Awarded!$A$2:$J$196,9,FALSE),0)","v":0},{"$f":"IFERROR(VLOOKUP($A77,Awarded!$A$2:$J$196,10,FALSE),0)","v":0},{"$f":"IFERROR(VLOOKUP($A77,Expended!$A$2:$J$198,5,FALSE),0)","v":10733.330000000002},{"$f":"IFERROR(VLOOKUP($A77,Expended!$A$2:$J$198,6,FALSE),0)","v":0},{"$f":"IFERROR(VLOOKUP($A77,Expended!$A$2:$J$198,7,FALSE),0)","v":128558.59},{"$f":"IFERROR(VLOOKUP($A77,Expended!$A$2:$J$198,8,FALSE),0)","v":0},{"$f":"IFERROR(VLOOKUP($A77,Expended!$A$2:$J$198,9,FALSE),0)","v":135692.84},{"$f":"IFERROR(VLOOKUP($A77,Expended!$A$2:$J$198,10,FALSE),0)","v":0},{"$f":"IFERROR(VLOOKUP($A77,Expended!$A$2:$L$198,11,FALSE),0)","v":0},{"$f":"VLOOKUP($A77,Prior!$A$1:$K$199,5,FALSE)","v":0},{"$f":"VLOOKUP($A77,Prior!$A$1:$K$199,6,FALSE)","v":0},{"$f":"VLOOKUP($A77,Prior!$A$1:$K$199,7,FALSE)","v":29307.3},{"$f":"VLOOKUP($A77,Prior!$A$1:$K$199,8,FALSE)","v":0},{"$f":"VLOOKUP($A77,Prior!$A$1:$K$199,9,FALSE)","v":0},{"$f":"VLOOKUP($A77,Prior!$A$1:$K$199,10,FALSE)","v":0},{"$f":"VLOOKUP($A77,Prior!$A$1:$K$199,11,FALSE)","v":0},9.8599999999969441,0,8.0000000005384209E-2,0,213450.16,0,0]
[453,"IDAHO VIRTUAL HIGH SCHOOL, INC.",170660455,{"$f":"IFERROR(VLOOKUP($A78,Awarded!$A$2:$J$196,4,FALSE),0)","v":13690.12},{"$f":"IFERROR(VLOOKUP($A78,Awarded!$A$2:$J$196,5,FALSE),0)","v":0},{"$f":"IFERROR(VLOOKUP($A78,Awarded!$A$2:$J$196,6,FALSE),0)","v":240392.95999999999},{"$f":"IFERROR(VLOOKUP($A78,Awarded!$A$2:$J$196,7,FALSE),0)","v":0},{"$f":"IFERROR(VLOOKUP($A78,Awarded!$A$2:$J$196,8,FALSE),0)","v":349143},{"$f":"IFERROR(VLOOKUP($A78,Awarded!$A$2:$J$196,9,FALSE),0)","v":0},{"$f":"IFERROR(VLOOKUP($A78,Awarded!$A$2:$J$196,10,FALSE),0)","v":0},{"$f":"IFERROR(VLOOKUP($A78,Expended!$A$2:$J$198,5,FALSE),0)","v":0},{"$f":"IFERROR(VLOOKUP($A78,Expended!$A$2:$J$198,6,FALSE),0)","v":0},{"$f":"IFERROR(VLOOKUP($A78,Expended!$A$2:$J$198,7,FALSE),0)","v":4916.96},{"$f":"IFERROR(VLOOKUP($A78,Expended!$A$2:$J$198,8,FALSE),0)","v":0},{"$f":"IFERROR(VLOOKUP($A78,Expended!$A$2:$J$198,9,FALSE),0)","v":59173.04},{"$f":"IFERROR(VLOOKUP($A78,Expended!$A$2:$J$198,10,FALSE),0)","v":0},{"$f":"IFERROR(VLOOKUP($A78,Expended!$A$2:$L$198,11,FALSE),0)","v":0},{"$f":"VLOOKUP($A78,Prior!$A$1:$K$199,5,FALSE)","v":13020},{"$f":"VLOOKUP($A78,Prior!$A$1:$K$199,6,FALSE)","v":0},{"$f":"VLOOKUP($A78,Prior!$A$1:$K$199,7,FALSE)","v":235476},{"$f":"VLOOKUP($A78,Prior!$A$1:$K$199,8,FALSE)","v":0},{"$f":"VLOOKUP($A78,Prior!$A$1:$K$199,9,FALSE)","v":0},{"$f":"VLOOKUP($A78,Prior!$A$1:$K$199,10,FALSE)","v":0},{"$f":"VLOOKUP($A78,Prior!$A$1:$K$199,11,FALSE)","v":0},670.1200000000008,0,0,0,289969.96000000002,0,0]
[457,"INSPIRE ACADEMICS, INC.",797530305,{"$f":"IFERROR(VLOOKUP($A79,Awarded!$A$2:$J$196,4,FALSE),0)","v":20680.87},{"$f":"IFERROR(VLOOKUP($A79,Awarded!$A$2:$J$196,5,FALSE),0)","v":151454.37},{"$f":"IFERROR(VLOOKUP($A79,Awarded!$A$2:$J$196,6,FALSE),0)","v":18913.86},{"$f":"IFERROR(VLOOKUP($A79,Awarded!$A$2:$J$196,7,FALSE),0)","v":859701.71},{"$f":"IFERROR(VLOOKUP($A79,Awarded!$A$2:$J$196,8,FALSE),0)","v":0},{"$f":"IFERROR(VLOOKUP($A79,Awarded!$A$2:$J$196,9,FALSE),0)","v":1543601.54},{"$f":"IFERROR(VLOOKUP($A79,Awarded!$A$2:$J$196,10,FALSE),0)","v":385593.49},{"$f":"IFERROR(VLOOKUP($A79,Expended!$A$2:$J$198,5,FALSE),0)","v":16038.87},{"$f":"IFERROR(VLOOKUP($A79,Expended!$A$2:$J$198,6,FALSE),0)","v":0},{"$f":"IFERROR(VLOOKUP($A79,Expended!$A$2:$J$198,7,FALSE),0)","v":0},{"$f":"IFERROR(VLOOKUP($A79,Expended!$A$2:$J$198,8,FALSE),0)","v":98689.88},{"$f":"IFERROR(VLOOKUP($A79,Expended!$A$2:$J$198,9,FALSE),0)","v":0},{"$f":"IFERROR(VLOOKUP($A79,Expended!$A$2:$J$198,10,FALSE),0)","v":642963.30000000005},{"$f":"IFERROR(VLOOKUP($A79,Expended!$A$2:$L$198,11,FALSE),0)","v":0},{"$f":"VLOOKUP($A79,Prior!$A$1:$K$199,5,FALSE)","v":4640},{"$f":"VLOOKUP($A79,Prior!$A$1:$K$199,6,FALSE)","v":151299},{"$f":"VLOOKUP($A79,Prior!$A$1:$K$199,7,FALSE)","v":871112.06},{"$f":"VLOOKUP($A79,Prior!$A$1:$K$199,8,FALSE)","v":759082.12000000011},{"$f":"VLOOKUP($A79,Prior!$A$1:$K$199,9,FALSE)","v":0},{"$f":"VLOOKUP($A79,Prior!$A$1:$K$199,10,FALSE)","v":0},{"$f":"VLOOKUP($A79,Prior!$A$1:$K$199,11,FALSE)","v":0},1.999999999998181,155.36999999999534,-852198.20000000007,1929.7099999998463,0,900638.24,385593.49]
[540,"ISLAND PARK CHARTER SCHOOL, INC.",117224934,{"$f":"IFERROR(VLOOKUP($A80,Awarded!$A$2:$J$196,4,FALSE),0)","v":8189.18},{"$f":"IFERROR(VLOOKUP($A80,Awarded!$A$2:$J$196,5,FALSE),0)","v":0},{"$f":"IFERROR(VLOOKUP($A80,Awarded!$A$2:$J$196,6,FALSE),0)","v":6041.57},{"$f":"IFERROR(VLOOKUP($A80,Awarded!$A$2:$J$196,7,FALSE),0)","v":0},{"$f":"IFERROR(VLOOKUP($A80,Awarded!$A$2:$J$196,8,FALSE),0)","v":349143},{"$f":"IFERROR(VLOOKUP($A80,Awarded!$A$2:$J$196,9,FALSE),0)","v":0},{"$f":"IFERROR(VLOOKUP($A80,Awarded!$A$2:$J$196,10,FALSE),0)","v":0},{"$f":"IFERROR(VLOOKUP($A80,Expended!$A$2:$J$198,5,FALSE),0)","v":285.18},{"$f":"IFERROR(VLOOKUP($A80,Expended!$A$2:$J$198,6,FALSE),0)","v":0},{"$f":"IFERROR(VLOOKUP($A80,Expended!$A$2:$J$198,7,FALSE),0)","v":2353.4299999999998},{"$f":"IFERROR(VLOOKUP($A80,Expended!$A$2:$J$198,8,FALSE),0)","v":0},{"$f":"IFERROR(VLOOKUP($A80,Expended!$A$2:$J$198,9,FALSE),0)","v":0},{"$f":"IFERROR(VLOOKUP($A80,Expended!$A$2:$J$198,10,FALSE),0)","v":0},{"$f":"IFERROR(VLOOKUP($A80,Expended!$A$2:$L$198,11,FALSE),0)","v":0},{"$f":"VLOOKUP($A80,Prior!$A$1:$K$199,5,FALSE)","v":7904},{"$f":"VLOOKUP($A80,Prior!$A$1:$K$199,6,FALSE)","v":0},{"$f":"VLOOKUP($A80,Prior!$A$1:$K$199,7,FALSE)","v":3688.14},{"$f":"VLOOKUP($A80,Prior!$A$1:$K$199,8,FALSE)","v":0},{"$f":"VLOOKUP($A80,Prior!$A$1:$K$199,9,FALSE)","v":0},{"$f":"VLOOKUP($A80,Prior!$A$1:$K$199,10,FALSE)","v":0},{"$f":"VLOOKUP($A80,Prior!$A$1:$K$199,11,FALSE)","v":0},0,0,0,0,349143,0,0]
[466,"ISUCCEED VIRTUAL HIGH SCHOOL, INC.",878662498,{"$f":"IFERROR(VLOOKUP($A81,Awarded!$A$2:$J$196,4,FALSE),0)","v":0},{"$f":"IFERROR(VLOOKUP($A81,Awarded!$A$2:$J$196,5,FALSE),0)","v":0},{"$f":"IFERROR(VLOOKUP($A81,Awarded!$A$2:$J$196,6,FALSE),0)","v":0},{"$f":"IFERROR(VLOOKUP($A81,Awarded!$A$2:$J$196,7,FALSE),0)","v":491878.08},{"$f":"IFERROR(VLOOKUP($A81,Awarded!$A$2:$J$196,8,FALSE),0)","v":0},{"$f":"IFERROR(VLOOKUP($A81,Awarded!$A$2:$J$196,9,FALSE),0)","v":883171.31},{"$f":"IFERROR(VLOOKUP($A81,Awarded!$A$2:$J$196,10,FALSE),0)","v":220617.38},{"$f":"IFERROR(VLOOKUP($A81,Expended!$A$2:$J$198,5,FALSE),0)","v":0},{"$f":"IFERROR(VLOOKUP($A81,Expended!$A$2:$J$198,6,FALSE),0)","v":0},{"$f":"IFERROR(VLOOKUP($A81,Expended!$A$2:$J$198,7,FALSE),0)","v":0},{"$f":"IFERROR(VLOOKUP($A81,Expended!$A$2:$J$198,8,FALSE),0)","v":375839.86},{"$f":"IFERROR(VLOOKUP($A81,Expended!$A$2:$J$198,9,FALSE),0)","v":0},{"$f":"IFERROR(VLOOKUP($A81,Expended!$A$2:$J$198,10,FALSE),0)","v":0},{"$f":"IFERROR(VLOOKUP($A81,Expended!$A$2:$L$198,11,FALSE),0)","v":0},{"$f":"VLOOKUP($A81,Prior!$A$1:$K$199,5,FALSE)","v":0},{"$f":"VLOOKUP($A81,Prior!$A$1:$K$199,6,FALSE)","v":0},{"$f":"VLOOKUP($A81,Prior!$A$1:$K$199,7,FALSE)","v":0},{"$f":"VLOOKUP($A81,Prior!$A$1:$K$199,8,FALSE)","v":8542.51},{"$f":"VLOOKUP($A81,Prior!$A$1:$K$199,9,FALSE)","v":0},{"$f":"VLOOKUP($A81,Prior!$A$1:$K$199,10,FALSE)","v":0},{"$f":"VLOOKUP($A81,Prior!$A$1:$K$199,11,FALSE)","v":0},0,0,0,107495.71000000004,0,883171.31,220617.38]
[251,"JEFFERSON COUNTY JOINT DISTRICT",29738903,{"$f":"IFERROR(VLOOKUP($A82,Awarded!$A$2:$J$196,4,FALSE),0)","v":81273.73},{"$f":"IFERROR(VLOOKUP($A82,Awarded!$A$2:$J$196,5,FALSE),0)","v":544638.71999999997},{"$f":"IFERROR(VLOOKUP($A82,Awarded!$A$2:$J$196,6,FALSE),0)","v":544478.68999999994},{"$f":"IFERROR(VLOOKUP($A82,Awarded!$A$2:$J$196,7,FALSE),0)","v":2025086.57},{"$f":"IFERROR(VLOOKUP($A82,Awarded!$A$2:$J$196,8,FALSE),0)","v":0},{"$f":"IFERROR(VLOOKUP($A82,Awarded!$A$2:$J$196,9,FALSE),0)","v":3636058.03},{"$f":"IFERROR(VLOOKUP($A82,Awarded!$A$2:$J$196,10,FALSE),0)","v":908291.94},{"$f":"IFERROR(VLOOKUP($A82,Expended!$A$2:$J$198,5,FALSE),0)","v":17197.41},{"$f":"IFERROR(VLOOKUP($A82,Expended!$A$2:$J$198,6,FALSE),0)","v":558.72},{"$f":"IFERROR(VLOOKUP($A82,Expended!$A$2:$J$198,7,FALSE),0)","v":0},{"$f":"IFERROR(VLOOKUP($A82,Expended!$A$2:$J$198,8,FALSE),0)","v":0},{"$f":"IFERROR(VLOOKUP($A82,Expended!$A$2:$J$198,9,FALSE),0)","v":0},{"$f":"IFERROR(VLOOKUP($A82,Expended!$A$2:$J$198,10,FALSE),0)","v":1939356.13},{"$f":"IFERROR(VLOOKUP($A82,Expended!$A$2:$L$198,11,FALSE),0)","v":131192.96000000002},{"$f":"VLOOKUP($A82,Prior!$A$1:$K$199,5,FALSE)","v":64076.32},{"$f":"VLOOKUP($A82,Prior!$A$1:$K$199,6,FALSE)","v":544080},{"$f":"VLOOKUP($A82,Prior!$A$1:$K$199,7,FALSE)","v":533342},{"$f":"VLOOKUP($A82,Prior!$A$1:$K$199,8,FALSE)","v":2020541},{"$f":"VLOOKUP($A82,Prior!$A$1:$K$199,9,FALSE)","v":0},{"$f":"VLOOKUP($A82,Prior!$A$1:$K$199,10,FALSE)","v":0},{"$f":"VLOOKUP($A82,Prior!$A$1:$K$199,11,FALSE)","v":0},0,0,11136.689999999944,4545.5700000000652,0,1696701.9,777098.98]
[261,"JEROME JOINT DISTRICT",100015056,{"$f":"IFERROR(VLOOKUP($A83,Awarded!$A$2:$J$196,4,FALSE),0)","v":54623.74},{"$f":"IFERROR(VLOOKUP($A83,Awarded!$A$2:$J$196,5,FALSE),0)","v":649537.32999999996},{"$f":"IFERROR(VLOOKUP($A83,Awarded!$A$2:$J$196,6,FALSE),0)","v":0},{"$f":"IFERROR(VLOOKUP($A83,Awarded!$A$2:$J$196,7,FALSE),0)","v":2634062.5},{"$f":"IFERROR(VLOOKUP($A83,Awarded!$A$2:$J$196,8,FALSE),0)","v":0},{"$f":"IFERROR(VLOOKUP($A83,Awarded!$A$2:$J$196,9,FALSE),0)","v":4729478.96},{"$f":"IFERROR(VLOOKUP($A83,Awarded!$A$2:$J$196,10,FALSE),0)","v":1181430.46},{"$f":"IFERROR(VLOOKUP($A83,Expended!$A$2:$J$198,5,FALSE),0)","v":1978.7399999999998},{"$f":"IFERROR(VLOOKUP($A83,Expended!$A$2:$J$198,6,FALSE),0)","v":666.33},{"$f":"IFERROR(VLOOKUP($A83,Expended!$A$2:$J$198,7,FALSE),0)","v":0},{"$f":"IFERROR(VLOOKUP($A83,Expended!$A$2:$J$198,8,FALSE),0)","v":557169.34},{"$f":"IFERROR(VLOOKUP($A83,Expended!$A$2:$J$198,9,FALSE),0)","v":0},{"$f":"IFERROR(VLOOKUP($A83,Expended!$A$2:$J$198,10,FALSE),0)","v":141832.62},{"$f":"IFERROR(VLOOKUP($A83,Expended!$A$2:$L$198,11,FALSE),0)","v":276653.31999999995},{"$f":"VLOOKUP($A83,Prior!$A$1:$K$199,5,FALSE)","v":52645},{"$f":"VLOOKUP($A83,Prior!$A$1:$K$199,6,FALSE)","v":648871},{"$f":"VLOOKUP($A83,Prior!$A$1:$K$199,7,FALSE)","v":0},{"$f":"VLOOKUP($A83,Prior!$A$1:$K$199,8,FALSE)","v":1079708.2999999998},{"$f":"VLOOKUP($A83,Prior!$A$1:$K$199,9,FALSE)","v":0},{"$f":"VLOOKUP($A83,Prior!$A$1:$K$199,10,FALSE)","v":113240.79000000001},{"$f":"VLOOKUP($A83,Prior!$A$1:$K$199,11,FALSE)","v":179656},0,0,0,997184.86000000034,0,4474405.55,725121.14]
[2,"JOINT SCHOOL DISTRICT NO. 2",29604402,{"$f":"IFERROR(VLOOKUP($A84,Awarded!$A$2:$J$196,4,FALSE),0)","v":461978.11},{"$f":"IFERROR(VLOOKUP($A84,Awarded!$A$2:$J$196,5,FALSE),0)","v":3080352.01},{"$f":"IFERROR(VLOOKUP($A84,Awarded!$A$2:$J$196,6,FALSE),0)","v":2389437.21},{"$f":"IFERROR(VLOOKUP($A84,Awarded!$A$2:$J$196,7,FALSE),0)","v":13883392.1},{"$f":"IFERROR(VLOOKUP($A84,Awarded!$A$2:$J$196,8,FALSE),0)","v":0},{"$f":"IFERROR(VLOOKUP($A84,Awarded!$A$2:$J$196,9,FALSE),0)","v":24927736.309999999},{"$f":"IFERROR(VLOOKUP($A84,Awarded!$A$2:$J$196,10,FALSE),0)","v":6226981.8399999999},{"$f":"IFERROR(VLOOKUP($A84,Expended!$A$2:$J$198,5,FALSE),0)","v":27551.020000000004},{"$f":"IFERROR(VLOOKUP($A84,Expended!$A$2:$J$198,6,FALSE),0)","v":21581.65},{"$f":"IFERROR(VLOOKUP($A84,Expended!$A$2:$J$198,7,FALSE),0)","v":1186958.3599999999},{"$f":"IFERROR(VLOOKUP($A84,Expended!$A$2:$J$198,8,FALSE),0)","v":10366378.520000001},{"$f":"IFERROR(VLOOKUP($A84,Expended!$A$2:$J$198,9,FALSE),0)","v":0},{"$f":"IFERROR(VLOOKUP($A84,Expended!$A$2:$J$198,10,FALSE),0)","v":11913174.43},{"$f":"IFERROR(VLOOKUP($A84,Expended!$A$2:$L$198,11,FALSE),0)","v":682396},{"$f":"VLOOKUP($A84,Prior!$A$1:$K$199,5,FALSE)","v":434427.08999999997},{"$f":"VLOOKUP($A84,Prior!$A$1:$K$199,6,FALSE)","v":3058770.3600000003},{"$f":"VLOOKUP($A84,Prior!$A$1:$K$199,7,FALSE)","v":0},{"$f":"VLOOKUP($A84,Prior!$A$1:$K$199,8,FALSE)","v":3517013.58},{"$f":"VLOOKUP($A84,Prior!$A$1:$K$199,9,FALSE)","v":0},{"$f":"VLOOKUP($A84,Prior!$A$1:$K$199,10,FALSE)","v":0},{"$f":"VLOOKUP($A84,Prior!$A$1:$K$199,11,FALSE)","v":431771.05},0,0,1202478.8500000001,0,0,13014561.879999999,5112814.79]
[304,"KAMIAH JOINT DISTRICT",159151398,{"$f":"IFERROR(VLOOKUP($A85,Awarded!$A$2:$J$196,4,FALSE),0)","v":12601.01},{"$f":"IFERROR(VLOOKUP($A85,Awarded!$A$2:$J$196,5,FALSE),0)","v":257136.79},{"$f":"IFERROR(VLOOKUP($A85,Awarded!$A$2:$J$196,6,FALSE),0)","v":0},{"$f":"IFERROR(VLOOKUP($A85,Awarded!$A$2:$J$196,7,FALSE),0)","v":1235562.3799999999},{"$f":"IFERROR(VLOOKUP($A85,Awarded!$A$2:$J$196,8,FALSE),0)","v":0},{"$f":"IFERROR(VLOOKUP($A85,Awarded!$A$2:$J$196,9,FALSE),0)","v":2218461.4900000002},{"$f":"IFERROR(VLOOKUP($A85,Awarded!$A$2:$J$196,10,FALSE),0)","v":554174.92000000004},{"$f":"IFERROR(VLOOKUP($A85,Expended!$A$2:$J$198,5,FALSE),0)","v":2978.8599999999997},{"$f":"IFERROR(VLOOKUP($A85,Expended!$A$2:$J$198,6,FALSE),0)","v":2860.91},{"$f":"IFERROR(VLOOKUP($A85,Expended!$A$2:$J$198,7,FALSE),0)","v":0},{"$f":"IFERROR(VLOOKUP($A85,Expended!$A$2:$J$198,8,FALSE),0)","v":435856.75000000006},{"$f":"IFERROR(VLOOKUP($A85,Expended!$A$2:$J$198,9,FALSE),0)","v":0},{"$f":"IFERROR(VLOOKUP($A85,Expended!$A$2:$J$198,10,FALSE),0)","v":90354.260000000009},{"$f":"IFERROR(VLOOKUP($A85,Expended!$A$2:$L$198,11,FALSE),0)","v":135591.29},{"$f":"VLOOKUP($A85,Prior!$A$1:$K$199,5,FALSE)","v":9433.93},{"$f":"VLOOKUP($A85,Prior!$A$1:$K$199,6,FALSE)","v":254012.09},{"$f":"VLOOKUP($A85,Prior!$A$1:$K$199,7,FALSE)","v":0},{"$f":"VLOOKUP($A85,Prior!$A$1:$K$199,8,FALSE)","v":72732.53},{"$f":"VLOOKUP($A85,Prior!$A$1:$K$199,9,FALSE)","v":0},{"$f":"VLOOKUP($A85,Prior!$A$1:$K$199,10,FALSE)","v":573513.77},{"$f":"VLOOKUP($A85,Prior!$A$1:$K$199,11,FALSE)","v":163947.60999999999},188.22000000000116,263.79000000000815,0,726973.09999999986,0,1554593.4600000004,254636.02000000002]
[391,"KELLOGG JOINT DISTRICT",100186402,{"$f":"IFERROR(VLOOKUP($A86,Awarded!$A$2:$J$196,4,FALSE),0)","v":20249.940000000002},{"$f":"IFERROR(VLOOKUP($A86,Awarded!$A$2:$J$196,5,FALSE),0)","v":263958.78000000003},{"$f":"IFERROR(VLOOKUP($A86,Awarded!$A$2:$J$196,6,FALSE),0)","v":0},{"$f":"IFERROR(VLOOKUP($A86,Awarded!$A$2:$J$196,7,FALSE),0)","v":1054899.8600000001},{"$f":"IFERROR(VLOOKUP($A86,Awarded!$A$2:$J$196,8,FALSE),0)","v":0},{"$f":"IFERROR(VLOOKUP($A86,Awarded!$A$2:$J$196,9,FALSE),0)","v":1894080.64},{"$f":"IFERROR(VLOOKUP($A86,Awarded!$A$2:$J$196,10,FALSE),0)","v":473144.39},{"$f":"IFERROR(VLOOKUP($A86,Expended!$A$2:$J$198,5,FALSE),0)","v":20249.940000000002},{"$f":"IFERROR(VLOOKUP($A86,Expended!$A$2:$J$198,6,FALSE),0)","v":270.77999999999997},{"$f":"IFERROR(VLOOKUP($A86,Expended!$A$2:$J$198,7,FALSE),0)","v":0},{"$f":"IFERROR(VLOOKUP($A86,Expended!$A$2:$J$198,8,FALSE),0)","v":2367.86},{"$f":"IFERROR(VLOOKUP($A86,Expended!$A$2:$J$198,9,FALSE),0)","v":0},{"$f":"IFERROR(VLOOKUP($A86,Expended!$A$2:$J$198,10,FALSE),0)","v":1069824},{"$f":"IFERROR(VLOOKUP($A86,Expended!$A$2:$L$198,11,FALSE),0)","v":132683.32999999999},{"$f":"VLOOKUP($A86,Prior!$A$1:$K$199,5,FALSE)","v":0},{"$f":"VLOOKUP($A86,Prior!$A$1:$K$199,6,FALSE)","v":263688},{"$f":"VLOOKUP($A86,Prior!$A$1:$K$199,7,FALSE)","v":0},{"$f":"VLOOKUP($A86,Prior!$A$1:$K$199,8,FALSE)","v":1052532},{"$f":"VLOOKUP($A86,Prior!$A$1:$K$199,9,FALSE)","v":0},{"$f":"VLOOKUP($A86,Prior!$A$1:$K$199,10,FALSE)","v":786491.59000000008},{"$f":"VLOOKUP($A86,Prior!$A$1:$K$199,11,FALSE)","v":0},0,0,0,0,0,37765.049999999814,340461.06000000006]
[283,"KENDRICK JOINT DISTRICT",100646397,{"$f":"IFERROR(VLOOKUP($A87,Awarded!$A$2:$J$196,4,FALSE),0)","v":10809.68},{"$f":"IFERROR(VLOOKUP($A87,Awarded!$A$2:$J$196,5,FALSE),0)","v":29230.99},{"$f":"IFERROR(VLOOKUP($A87,Awarded!$A$2:$J$196,6,FALSE),0)","v":35743.08},{"$f":"IFERROR(VLOOKUP($A87,Awarded!$A$2:$J$196,7,FALSE),0)","v":101719.32},{"$f":"IFERROR(VLOOKUP($A87,Awarded!$A$2:$J$196,8,FALSE),0)","v":122006},{"$f":"IFERROR(VLOOKUP($A87,Awarded!$A$2:$J$196,9,FALSE),0)","v":182636.62},{"$f":"IFERROR(VLOOKUP($A87,Awarded!$A$2:$J$196,10,FALSE),0)","v":45622.62},{"$f":"IFERROR(VLOOKUP($A87,Expended!$A$2:$J$198,5,FALSE),0)","v":6189.6299999999992},{"$f":"IFERROR(VLOOKUP($A87,Expended!$A$2:$J$198,6,FALSE),0)","v":578.30999999999995},{"$f":"IFERROR(VLOOKUP($A87,Expended!$A$2:$J$198,7,FALSE),0)","v":20365},{"$f":"IFERROR(VLOOKUP($A87,Expended!$A$2:$J$198,8,FALSE),0)","v":51395.26},{"$f":"IFERROR(VLOOKUP($A87,Expended!$A$2:$J$198,9,FALSE),0)","v":22862.690000000002},{"$f":"IFERROR(VLOOKUP($A87,Expended!$A$2:$J$198,10,FALSE),0)","v":0},{"$f":"IFERROR(VLOOKUP($A87,Expended!$A$2:$L$198,11,FALSE),0)","v":2512.58},{"$f":"VLOOKUP($A87,Prior!$A$1:$K$199,5,FALSE)","v":4620.05},{"$f":"VLOOKUP($A87,Prior!$A$1:$K$199,6,FALSE)","v":28652.68},{"$f":"VLOOKUP($A87,Prior!$A$1:$K$199,7,FALSE)","v":0},{"$f":"VLOOKUP($A87,Prior!$A$1:$K$199,8,FALSE)","v":0},{"$f":"VLOOKUP($A87,Prior!$A$1:$K$199,9,FALSE)","v":0},{"$f":"VLOOKUP($A87,Prior!$A$1:$K$199,10,FALSE)","v":0},{"$f":"VLOOKUP($A87,Prior!$A$1:$K$199,11,FALSE)","v":0},0,0,15378.080000000002,50324.060000000005,99143.31,182636.62,43110.04]
[414,"KIMBERLY DISTRICT",879016921,{"$f":"IFERROR(VLOOKUP($A88,Awarded!$A$2:$J$196,4,FALSE),0)","v":34045.71},{"$f":"IFERROR(VLOOKUP($A88,Awarded!$A$2:$J$196,5,FALSE),0)","v":140118.74},{"$f":"IFERROR(VLOOKUP($A88,Awarded!$A$2:$J$196,6,FALSE),0)","v":223946.57},{"$f":"IFERROR(VLOOKUP($A88,Awarded!$A$2:$J$196,7,FALSE),0)","v":583633.04},{"$f":"IFERROR(VLOOKUP($A88,Awarded!$A$2:$J$196,8,FALSE),0)","v":0},{"$f":"IFERROR(VLOOKUP($A88,Awarded!$A$2:$J$196,9,FALSE),0)","v":1047917.2},{"$f":"IFERROR(VLOOKUP($A88,Awarded!$A$2:$J$196,10,FALSE),0)","v":261771.38},{"$f":"IFERROR(VLOOKUP($A88,Expended!$A$2:$J$198,5,FALSE),0)","v":3560.71},{"$f":"IFERROR(VLOOKUP($A88,Expended!$A$2:$J$198,6,FALSE),0)","v":143.74},{"$f":"IFERROR(VLOOKUP($A88,Expended!$A$2:$J$198,7,FALSE),0)","v":4418.3500000000004},{"$f":"IFERROR(VLOOKUP($A88,Expended!$A$2:$J$198,8,FALSE),0)","v":179588.52000000002},{"$f":"IFERROR(VLOOKUP($A88,Expended!$A$2:$J$198,9,FALSE),0)","v":0},{"$f":"IFERROR(VLOOKUP($A88,Expended!$A$2:$J$198,10,FALSE),0)","v":98120},{"$f":"IFERROR(VLOOKUP($A88,Expended!$A$2:$L$198,11,FALSE),0)","v":50198.82},{"$f":"VLOOKUP($A88,Prior!$A$1:$K$199,5,FALSE)","v":30485},{"$f":"VLOOKUP($A88,Prior!$A$1:$K$199,6,FALSE)","v":139975},{"$f":"VLOOKUP($A88,Prior!$A$1:$K$199,7,FALSE)","v":219360.73},{"$f":"VLOOKUP($A88,Prior!$A$1:$K$199,8,FALSE)","v":377412.2},{"$f":"VLOOKUP($A88,Prior!$A$1:$K$199,9,FALSE)","v":0},{"$f":"VLOOKUP($A88,Prior!$A$1:$K$199,10,FALSE)","v":0},{"$f":"VLOOKUP($A88,Prior!$A$1:$K$199,11,FALSE)","v":136891.32999999999},0,0,167.48999999999069,26632.320000000007,0,949797.2,74681.23000000001]
[274,"KOOTENAI DISTRICT",100646405,{"$f":"IFERROR(VLOOKUP($A89,Awarded!$A$2:$J$196,4,FALSE),0)","v":9575.2199999999993},{"$f":"IFERROR(VLOOKUP($A89,Awarded!$A$2:$J$196,5,FALSE),0)","v":43701.83},{"$f":"IFERROR(VLOOKUP($A89,Awarded!$A$2:$J$196,6,FALSE),0)","v":0},{"$f":"IFERROR(VLOOKUP($A89,Awarded!$A$2:$J$196,7,FALSE),0)","v":161283.01999999999},{"$f":"IFERROR(VLOOKUP($A89,Awarded!$A$2:$J$196,8,FALSE),0)","v":0},{"$f":"IFERROR(VLOOKUP($A89,Awarded!$A$2:$J$196,9,FALSE),0)","v":289584.53999999998},{"$f":"IFERROR(VLOOKUP($A89,Awarded!$A$2:$J$196,10,FALSE),0)","v":72338.36},{"$f":"IFERROR(VLOOKUP($A89,Expended!$A$2:$J$198,5,FALSE),0)","v":0},{"$f":"IFERROR(VLOOKUP($A89,Expended!$A$2:$J$198,6,FALSE),0)","v":44.83},{"$f":"IFERROR(VLOOKUP($A89,Expended!$A$2:$J$198,7,FALSE),0)","v":0},{"$f":"IFERROR(VLOOKUP($A89,Expended!$A$2:$J$198,8,FALSE),0)","v":36445.78},{"$f":"IFERROR(VLOOKUP($A89,Expended!$A$2:$J$198,9,FALSE),0)","v":0},{"$f":"IFERROR(VLOOKUP($A89,Expended!$A$2:$J$198,10,FALSE),0)","v":107070.95},{"$f":"IFERROR(VLOOKUP($A89,Expended!$A$2:$L$198,11,FALSE),0)","v":38738.990000000005},{"$f":"VLOOKUP($A89,Prior!$A$1:$K$199,5,FALSE)","v":9537},{"$f":"VLOOKUP($A89,Prior!$A$1:$K$199,6,FALSE)","v":43657},{"$f":"VLOOKUP($A89,Prior!$A$1:$K$199,7,FALSE)","v":0},{"$f":"VLOOKUP($A89,Prior!$A$1:$K$199,8,FALSE)","v":124837.23999999999},{"$f":"VLOOKUP($A89,Prior!$A$1:$K$199,9,FALSE)","v":0},{"$f":"VLOOKUP($A89,Prior!$A$1:$K$199,10,FALSE)","v":80968.649999999994},{"$f":"VLOOKUP($A89,Prior!$A$1:$K$199,11,FALSE)","v":33599.370000000003},38.219999999999345,0,0,0,0,101544.93999999997,0]
[3,"KUNA JOINT DISTRICT",100015072,{"$f":"IFERROR(VLOOKUP($A90,Awarded!$A$2:$J$196,4,FALSE),0)","v":71160.800000000003},{"$f":"IFERROR(VLOOKUP($A90,Awarded!$A$2:$J$196,5,FALSE),0)","v":853029.09},{"$f":"IFERROR(VLOOKUP($A90,Awarded!$A$2:$J$196,6,FALSE),0)","v":0},{"$f":"IFERROR(VLOOKUP($A90,Awarded!$A$2:$J$196,7,FALSE),0)","v":2925376.39},{"$f":"IFERROR(VLOOKUP($A90,Awarded!$A$2:$J$196,8,FALSE),0)","v":0},{"$f":"IFERROR(VLOOKUP($A90,Awarded!$A$2:$J$196,9,FALSE),0)","v":5252536.0199999996},{"$f":"IFERROR(VLOOKUP($A90,Awarded!$A$2:$J$196,10,FALSE),0)","v":1312090.07},{"$f":"IFERROR(VLOOKUP($A90,Expended!$A$2:$J$198,5,FALSE),0)","v":2581.8000000000002},{"$f":"IFERROR(VLOOKUP($A90,Expended!$A$2:$J$198,6,FALSE),0)","v":875.09},{"$f":"IFERROR(VLOOKUP($A90,Expended!$A$2:$J$198,7,FALSE),0)","v":0},{"$f":"IFERROR(VLOOKUP($A90,Expended!$A$2:$J$198,8,FALSE),0)","v":1260484.03},{"$f":"IFERROR(VLOOKUP($A90,Expended!$A$2:$J$198,9,FALSE),0)","v":0},{"$f":"IFERROR(VLOOKUP($A90,Expended!$A$2:$J$198,10,FALSE),0)","v":1003747.75},{"$f":"IFERROR(VLOOKUP($A90,Expended!$A$2:$L$198,11,FALSE),0)","v":999680.15999999992},{"$f":"VLOOKUP($A90,Prior!$A$1:$K$199,5,FALSE)","v":68579},{"$f":"VLOOKUP($A90,Prior!$A$1:$K$199,6,FALSE)","v":852154},{"$f":"VLOOKUP($A90,Prior!$A$1:$K$199,7,FALSE)","v":0},{"$f":"VLOOKUP($A90,Prior!$A$1:$K$199,8,FALSE)","v":1664892.36},{"$f":"VLOOKUP($A90,Prior!$A$1:$K$199,9,FALSE)","v":0},{"$f":"VLOOKUP($A90,Prior!$A$1:$K$199,10,FALSE)","v":0},{"$f":"VLOOKUP($A90,Prior!$A$1:$K$199,11,FALSE)","v":312409.91000000003},0,0,0,0,0,4248788.2699999996,0]
[84,"LAKE PEND OREILLE SCHOOL DISTRICT",832156884,{"$f":"IFERROR(VLOOKUP($A91,Awarded!$A$2:$J$196,4,FALSE),0)","v":39116.19},{"$f":"IFERROR(VLOOKUP($A91,Awarded!$A$2:$J$196,5,FALSE),0)","v":569861.6},{"$f":"IFERROR(VLOOKUP($A91,Awarded!$A$2:$J$196,6,FALSE),0)","v":0},{"$f":"IFERROR(VLOOKUP($A91,Awarded!$A$2:$J$196,7,FALSE),0)","v":2553329.2799999998},{"$f":"IFERROR(VLOOKUP($A91,Awarded!$A$2:$J$196,8,FALSE),0)","v":0},{"$f":"IFERROR(VLOOKUP($A91,Awarded!$A$2:$J$196,9,FALSE),0)","v":4584522},{"$f":"IFERROR(VLOOKUP($A91,Awarded!$A$2:$J$196,10,FALSE),0)","v":1145220.27},{"$f":"IFERROR(VLOOKUP($A91,Expended!$A$2:$J$198,5,FALSE),0)","v":24936.190000000002},{"$f":"IFERROR(VLOOKUP($A91,Expended!$A$2:$J$198,6,FALSE),0)","v":584.6},{"$f":"IFERROR(VLOOKUP($A91,Expended!$A$2:$J$198,7,FALSE),0)","v":0},{"$f":"IFERROR(VLOOKUP($A91,Expended!$A$2:$J$198,8,FALSE),0)","v":0},{"$f":"IFERROR(VLOOKUP($A91,Expended!$A$2:$J$198,9,FALSE),0)","v":0},{"$f":"IFERROR(VLOOKUP($A91,Expended!$A$2:$J$198,10,FALSE),0)","v":2700377.97},{"$f":"IFERROR(VLOOKUP($A91,Expended!$A$2:$L$198,11,FALSE),0)","v":446781.61999999994},{"$f":"VLOOKUP($A91,Prior!$A$1:$K$199,5,FALSE)","v":14180},{"$f":"VLOOKUP($A91,Prior!$A$1:$K$199,6,FALSE)","v":569277},{"$f":"VLOOKUP($A91,Prior!$A$1:$K$199,7,FALSE)","v":0},{"$f":"VLOOKUP($A91,Prior!$A$1:$K$199,8,FALSE)","v":2547598.0000000005},{"$f":"VLOOKUP($A91,Prior!$A$1:$K$199,9,FALSE)","v":0},{"$f":"VLOOKUP($A91,Prior!$A$1:$K$199,10,FALSE)","v":644692.10999999987},{"$f":"VLOOKUP($A91,Prior!$A$1:$K$199,11,FALSE)","v":547667.97},0,0,0,5731.2799999993294,0,1239451.92,150770.68000000017]
[272,"LAKELAND DISTRICT",100015080,{"$f":"IFERROR(VLOOKUP($A92,Awarded!$A$2:$J$196,4,FALSE),0)","v":59617.909999999996},{"$f":"IFERROR(VLOOKUP($A92,Awarded!$A$2:$J$196,5,FALSE),0)","v":750789.2},{"$f":"IFERROR(VLOOKUP($A92,Awarded!$A$2:$J$196,6,FALSE),0)","v":0},{"$f":"IFERROR(VLOOKUP($A92,Awarded!$A$2:$J$196,7,FALSE),0)","v":2618696.0099999998},{"$f":"IFERROR(VLOOKUP($A92,Awarded!$A$2:$J$196,8,FALSE),0)","v":0},{"$f":"IFERROR(VLOOKUP($A92,Awarded!$A$2:$J$196,9,FALSE),0)","v":4701888.99},{"$f":"IFERROR(VLOOKUP($A92,Awarded!$A$2:$J$196,10,FALSE),0)","v":1174537.95},{"$f":"IFERROR(VLOOKUP($A92,Expended!$A$2:$J$198,5,FALSE),0)","v":2160.9100000000003},{"$f":"IFERROR(VLOOKUP($A92,Expended!$A$2:$J$198,6,FALSE),0)","v":770.2},{"$f":"IFERROR(VLOOKUP($A92,Expended!$A$2:$J$198,7,FALSE),0)","v":0},{"$f":"IFERROR(VLOOKUP($A92,Expended!$A$2:$J$198,8,FALSE),0)","v":597855.64},{"$f":"IFERROR(VLOOKUP($A92,Expended!$A$2:$J$198,9,FALSE),0)","v":0},{"$f":"IFERROR(VLOOKUP($A92,Expended!$A$2:$J$198,10,FALSE),0)","v":2022571.65},{"$f":"IFERROR(VLOOKUP($A92,Expended!$A$2:$L$198,11,FALSE),0)","v":1042717.32},{"$f":"VLOOKUP($A92,Prior!$A$1:$K$199,5,FALSE)","v":57457},{"$f":"VLOOKUP($A92,Prior!$A$1:$K$199,6,FALSE)","v":750019},{"$f":"VLOOKUP($A92,Prior!$A$1:$K$199,7,FALSE)","v":0},{"$f":"VLOOKUP($A92,Prior!$A$1:$K$199,8,FALSE)","v":2020840.3699999999},{"$f":"VLOOKUP($A92,Prior!$A$1:$K$199,9,FALSE)","v":0},{"$f":"VLOOKUP($A92,Prior!$A$1:$K$199,10,FALSE)","v":0},{"$f":"VLOOKUP($A92,Prior!$A$1:$K$199,11,FALSE)","v":0},0,0,0,0,0,2679317.3400000003,131820.63]
[341,"LAPWAI DISTRICT",100015098,{"$f":"IFERROR(VLOOKUP($A93,Awarded!$A$2:$J$196,4,FALSE),0)","v":11991},{"$f":"IFERROR(VLOOKUP($A93,Awarded!$A$2:$J$196,5,FALSE),0)","v":149100.96},{"$f":"IFERROR(VLOOKUP($A93,Awarded!$A$2:$J$196,6,FALSE),0)","v":0},{"$f":"IFERROR(VLOOKUP($A93,Awarded!$A$2:$J$196,7,FALSE),0)","v":555908.81000000006},{"$f":"IFERROR(VLOOKUP($A93,Awarded!$A$2:$J$196,8,FALSE),0)","v":0},{"$f":"IFERROR(VLOOKUP($A93,Awarded!$A$2:$J$196,9,FALSE),0)","v":998137.52},{"$f":"IFERROR(VLOOKUP($A93,Awarded!$A$2:$J$196,10,FALSE),0)","v":249335.85},{"$f":"IFERROR(VLOOKUP($A93,Expended!$A$2:$J$198,5,FALSE),0)","v":0},{"$f":"IFERROR(VLOOKUP($A93,Expended!$A$2:$J$198,6,FALSE),0)","v":152.96},{"$f":"IFERROR(VLOOKUP($A93,Expended!$A$2:$J$198,7,FALSE),0)","v":0},{"$f":"IFERROR(VLOOKUP($A93,Expended!$A$2:$J$198,8,FALSE),0)","v":1247.81},{"$f":"IFERROR(VLOOKUP($A93,Expended!$A$2:$J$198,9,FALSE),0)","v":0},{"$f":"IFERROR(VLOOKUP($A93,Expended!$A$2:$J$198,10,FALSE),0)","v":696561.72000000009},{"$f":"IFERROR(VLOOKUP($A93,Expended!$A$2:$L$198,11,FALSE),0)","v":106293.60999999999},{"$f":"VLOOKUP($A93,Prior!$A$1:$K$199,5,FALSE)","v":11991},{"$f":"VLOOKUP($A93,Prior!$A$1:$K$199,6,FALSE)","v":148948},{"$f":"VLOOKUP($A93,Prior!$A$1:$K$199,7,FALSE)","v":0},{"$f":"VLOOKUP($A93,Prior!$A$1:$K$199,8,FALSE)","v":554661},{"$f":"VLOOKUP($A93,Prior!$A$1:$K$199,9,FALSE)","v":0},{"$f":"VLOOKUP($A93,Prior!$A$1:$K$199,10,FALSE)","v":198785.39},{"$f":"VLOOKUP($A93,Prior!$A$1:$K$199,11,FALSE)","v":0},0,0,0,0,0,102790.40999999992,143042.24000000002]
[478,"LEGACY PUBLIC CHARTER SCHOOL, INC.",968870522,{"$f":"IFERROR(VLOOKUP($A94,Awarded!$A$2:$J$196,4,FALSE),0)","v":11231},{"$f":"IFERROR(VLOOKUP($A94,Awarded!$A$2:$J$196,5,FALSE),0)","v":36159.089999999997},{"$f":"IFERROR(VLOOKUP($A94,Awarded!$A$2:$J$196,6,FALSE),0)","v":12789.6},{"$f":"IFERROR(VLOOKUP($A94,Awarded!$A$2:$J$196,7,FALSE),0)","v":129394.44},{"$f":"IFERROR(VLOOKUP($A94,Awarded!$A$2:$J$196,8,FALSE),0)","v":60208},{"$f":"IFERROR(VLOOKUP($A94,Awarded!$A$2:$J$196,9,FALSE),0)","v":232328.19},{"$f":"IFERROR(VLOOKUP($A94,Awarded!$A$2:$J$196,10,FALSE),0)","v":58036.15},{"$f":"IFERROR(VLOOKUP($A94,Expended!$A$2:$J$198,5,FALSE),0)","v":0},{"$f":"IFERROR(VLOOKUP($A94,Expended!$A$2:$J$198,6,FALSE),0)","v":37.090000000000003},{"$f":"IFERROR(VLOOKUP($A94,Expended!$A$2:$J$198,7,FALSE),0)","v":6789.5999999999995},{"$f":"IFERROR(VLOOKUP($A94,Expended!$A$2:$J$198,8,FALSE),0)","v":1477.61},{"$f":"IFERROR(VLOOKUP($A94,Expended!$A$2:$J$198,9,FALSE),0)","v":20042.86},{"$f":"IFERROR(VLOOKUP($A94,Expended!$A$2:$J$198,10,FALSE),0)","v":64567.47},{"$f":"IFERROR(VLOOKUP($A94,Expended!$A$2:$L$198,11,FALSE),0)","v":28774},{"$f":"VLOOKUP($A94,Prior!$A$1:$K$199,5,FALSE)","v":11231},{"$f":"VLOOKUP($A94,Prior!$A$1:$K$199,6,FALSE)","v":36122},{"$f":"VLOOKUP($A94,Prior!$A$1:$K$199,7,FALSE)","v":6000},{"$f":"VLOOKUP($A94,Prior!$A$1:$K$199,8,FALSE)","v":127916.83},{"$f":"VLOOKUP($A94,Prior!$A$1:$K$199,9,FALSE)","v":0},{"$f":"VLOOKUP($A94,Prior!$A$1:$K$199,10,FALSE)","v":162985.56},{"$f":"VLOOKUP($A94,Prior!$A$1:$K$199,11,FALSE)","v":22786.080000000002},0,0,0,0,40165.14,4775.1600000000035,6476.07]
[340,"LEWISTON INDEPENDENT DISTRICT",100186600,{"$f":"IFERROR(VLOOKUP($A95,Awarded!$A$2:$J$196,4,FALSE),0)","v":61618.18},{"$f":"IFERROR(VLOOKUP($A95,Awarded!$A$2:$J$196,5,FALSE),0)","v":633464.85},{"$f":"IFERROR(VLOOKUP($A95,Awarded!$A$2:$J$196,6,FALSE),0)","v":0},{"$f":"IFERROR(VLOOKUP($A95,Awarded!$A$2:$J$196,7,FALSE),0)","v":2531617.5499999998},{"$f":"IFERROR(VLOOKUP($A95,Awarded!$A$2:$J$196,8,FALSE),0)","v":0},{"$f":"IFERROR(VLOOKUP($A95,Awarded!$A$2:$J$196,9,FALSE),0)","v":4545538.83},{"$f":"IFERROR(VLOOKUP($A95,Awarded!$A$2:$J$196,10,FALSE),0)","v":1135481.72},{"$f":"IFERROR(VLOOKUP($A95,Expended!$A$2:$J$198,5,FALSE),0)","v":27593.83},{"$f":"IFERROR(VLOOKUP($A95,Expended!$A$2:$J$198,6,FALSE),0)","v":649.85},{"$f":"IFERROR(VLOOKUP($A95,Expended!$A$2:$J$198,7,FALSE),0)","v":0},{"$f":"IFERROR(VLOOKUP($A95,Expended!$A$2:$J$198,8,FALSE),0)","v":251149.06},{"$f":"IFERROR(VLOOKUP($A95,Expended!$A$2:$J$198,9,FALSE),0)","v":0},{"$f":"IFERROR(VLOOKUP($A95,Expended!$A$2:$J$198,10,FALSE),0)","v":1022859.74},{"$f":"IFERROR(VLOOKUP($A95,Expended!$A$2:$L$198,11,FALSE),0)","v":751827.95},{"$f":"VLOOKUP($A95,Prior!$A$1:$K$199,5,FALSE)","v":34024.35},{"$f":"VLOOKUP($A95,Prior!$A$1:$K$199,6,FALSE)","v":632815},{"$f":"VLOOKUP($A95,Prior!$A$1:$K$199,7,FALSE)","v":0},{"$f":"VLOOKUP($A95,Prior!$A$1:$K$199,8,FALSE)","v":2280468.4900000002},{"$f":"VLOOKUP($A95,Prior!$A$1:$K$199,9,FALSE)","v":0},{"$f":"VLOOKUP($A95,Prior!$A$1:$K$199,10,FALSE)","v":141083.07},{"$f":"VLOOKUP($A95,Prior!$A$1:$K$199,11,FALSE)","v":383653.77},0,0,0,0,0,3381596.02,0]
[458,"LIBERTY CHARTER SCHOOL, INC.",105529221,{"$f":"IFERROR(VLOOKUP($A96,Awarded!$A$2:$J$196,4,FALSE),0)","v":12198},{"$f":"IFERROR(VLOOKUP($A96,Awarded!$A$2:$J$196,5,FALSE),0)","v":42083.17},{"$f":"IFERROR(VLOOKUP($A96,Awarded!$A$2:$J$196,6,FALSE),0)","v":68382.69},{"$f":"IFERROR(VLOOKUP($A96,Awarded!$A$2:$J$196,7,FALSE),0)","v":144635.65},{"$f":"IFERROR(VLOOKUP($A96,Awarded!$A$2:$J$196,8,FALSE),0)","v":26174},{"$f":"IFERROR(VLOOKUP($A96,Awarded!$A$2:$J$196,9,FALSE),0)","v":259693.9},{"$f":"IFERROR(VLOOKUP($A96,Awarded!$A$2:$J$196,10,FALSE),0)","v":64871.64},{"$f":"IFERROR(VLOOKUP($A96,Expended!$A$2:$J$198,5,FALSE),0)","v":0},{"$f":"IFERROR(VLOOKUP($A96,Expended!$A$2:$J$198,6,FALSE),0)","v":43.17},{"$f":"IFERROR(VLOOKUP($A96,Expended!$A$2:$J$198,7,FALSE),0)","v":68382.69},{"$f":"IFERROR(VLOOKUP($A96,Expended!$A$2:$J$198,8,FALSE),0)","v":324.64999999999998},{"$f":"IFERROR(VLOOKUP($A96,Expended!$A$2:$J$198,9,FALSE),0)","v":26174},{"$f":"IFERROR(VLOOKUP($A96,Expended!$A$2:$J$198,10,FALSE),0)","v":23280.97},{"$f":"IFERROR(VLOOKUP($A96,Expended!$A$2:$L$198,11,FALSE),0)","v":21156.04},{"$f":"VLOOKUP($A96,Prior!$A$1:$K$199,5,FALSE)","v":12198},{"$f":"VLOOKUP($A96,Prior!$A$1:$K$199,6,FALSE)","v":42040},{"$f":"VLOOKUP($A96,Prior!$A$1:$K$199,7,FALSE)","v":0},{"$f":"VLOOKUP($A96,Prior!$A$1:$K$199,8,FALSE)","v":144311},{"$f":"VLOOKUP($A96,Prior!$A$1:$K$199,9,FALSE)","v":0},{"$f":"VLOOKUP($A96,Prior!$A$1:$K$199,10,FALSE)","v":236412.93},{"$f":"VLOOKUP($A96,Prior!$A$1:$K$199,11,FALSE)","v":34248.120000000003},0,0,0,0,0,0,9467.4799999999959]
[182,"MACKAY JOINT DISTRICT",25531166,{"$f":"IFERROR(VLOOKUP($A97,Awarded!$A$2:$J$196,4,FALSE),0)","v":13041.69},{"$f":"IFERROR(VLOOKUP($A97,Awarded!$A$2:$J$196,5,FALSE),0)","v":24140.77},{"$f":"IFERROR(VLOOKUP($A97,Awarded!$A$2:$J$196,6,FALSE),0)","v":41917.370000000003},{"$f":"IFERROR(VLOOKUP($A97,Awarded!$A$2:$J$196,7,FALSE),0)","v":82788.83},{"$f":"IFERROR(VLOOKUP($A97,Awarded!$A$2:$J$196,8,FALSE),0)","v":164276},{"$f":"IFERROR(VLOOKUP($A97,Awarded!$A$2:$J$196,9,FALSE),0)","v":148648.24},{"$f":"IFERROR(VLOOKUP($A97,Awarded!$A$2:$J$196,10,FALSE),0)","v":37132.53},{"$f":"IFERROR(VLOOKUP($A97,Expended!$A$2:$J$198,5,FALSE),0)","v":13000.16},{"$f":"IFERROR(VLOOKUP($A97,Expended!$A$2:$J$198,6,FALSE),0)","v":13119.599999999999},{"$f":"IFERROR(VLOOKUP($A97,Expended!$A$2:$J$198,7,FALSE),0)","v":0},{"$f":"IFERROR(VLOOKUP($A97,Expended!$A$2:$J$198,8,FALSE),0)","v":82603},{"$f":"IFERROR(VLOOKUP($A97,Expended!$A$2:$J$198,9,FALSE),0)","v":100000},{"$f":"IFERROR(VLOOKUP($A97,Expended!$A$2:$J$198,10,FALSE),0)","v":148000},{"$f":"IFERROR(VLOOKUP($A97,Expended!$A$2:$L$198,11,FALSE),0)","v":10101.370000000001},{"$f":"VLOOKUP($A97,Prior!$A$1:$K$199,5,FALSE)","v":0},{"$f":"VLOOKUP($A97,Prior!$A$1:$K$199,6,FALSE)","v":11021.17},{"$f":"VLOOKUP($A97,Prior!$A$1:$K$199,7,FALSE)","v":0},{"$f":"VLOOKUP($A97,Prior!$A$1:$K$199,8,FALSE)","v":0},{"$f":"VLOOKUP($A97,Prior!$A$1:$K$199,9,FALSE)","v":0},{"$f":"VLOOKUP($A97,Prior!$A$1:$K$199,10,FALSE)","v":0},{"$f":"VLOOKUP($A97,Prior!$A$1:$K$199,11,FALSE)","v":0},41.530000000000655,0,41917.370000000003,185.83000000000175,64276,648.23999999999069,27031.159999999996]
[321,"MADISON DISTRICT",100646413,{"$f":"IFERROR(VLOOKUP($A98,Awarded!$A$2:$J$196,4,FALSE),0)","v":71227.179999999993},{"$f":"IFERROR(VLOOKUP($A98,Awarded!$A$2:$J$196,5,FALSE),0)","v":824270.59},{"$f":"IFERROR(VLOOKUP($A98,Awarded!$A$2:$J$196,6,FALSE),0)","v":0},{"$f":"IFERROR(VLOOKUP($A98,Awarded!$A$2:$J$196,7,FALSE),0)","v":3439153.63},{"$f":"IFERROR(VLOOKUP($A98,Awarded!$A$2:$J$196,8,FALSE),0)","v":0},{"$f":"IFERROR(VLOOKUP($A98,Awarded!$A$2:$J$196,9,FALSE),0)","v":6175025.8899999997},{"$f":"IFERROR(VLOOKUP($A98,Awarded!$A$2:$J$196,10,FALSE),0)","v":1542530.03},{"$f":"IFERROR(VLOOKUP($A98,Expended!$A$2:$J$198,5,FALSE),0)","v":4783.18},{"$f":"IFERROR(VLOOKUP($A98,Expended!$A$2:$J$198,6,FALSE),0)","v":845.59},{"$f":"IFERROR(VLOOKUP($A98,Expended!$A$2:$J$198,7,FALSE),0)","v":0},{"$f":"IFERROR(VLOOKUP($A98,Expended!$A$2:$J$198,8,FALSE),0)","v":7719.63},{"$f":"IFERROR(VLOOKUP($A98,Expended!$A$2:$J$198,9,FALSE),0)","v":0},{"$f":"IFERROR(VLOOKUP($A98,Expended!$A$2:$J$198,10,FALSE),0)","v":3328648.31},{"$f":"IFERROR(VLOOKUP($A98,Expended!$A$2:$L$198,11,FALSE),0)","v":1048080.9199999999},{"$f":"VLOOKUP($A98,Prior!$A$1:$K$199,5,FALSE)","v":66444},{"$f":"VLOOKUP($A98,Prior!$A$1:$K$199,6,FALSE)","v":823425},{"$f":"VLOOKUP($A98,Prior!$A$1:$K$199,7,FALSE)","v":0},{"$f":"VLOOKUP($A98,Prior!$A$1:$K$199,8,FALSE)","v":3431434},{"$f":"VLOOKUP($A98,Prior!$A$1:$K$199,9,FALSE)","v":0},{"$f":"VLOOKUP($A98,Prior!$A$1:$K$199,10,FALSE)","v":1303169.8999999999},{"$f":"VLOOKUP($A98,Prior!$A$1:$K$199,11,FALSE)","v":494449.11},0,0,0,0,0,1543207.6799999997,0]
[21,"MARSH VALLEY JOINT DISTRICT",193088374,{"$f":"IFERROR(VLOOKUP($A99,Awarded!$A$2:$J$196,4,FALSE),0)","v":22280.510000000002},{"$f":"IFERROR(VLOOKUP($A99,Awarded!$A$2:$J$196,5,FALSE),0)","v":165074.34},{"$f":"IFERROR(VLOOKUP($A99,Awarded!$A$2:$J$196,6,FALSE),0)","v":0},{"$f":"IFERROR(VLOOKUP($A99,Awarded!$A$2:$J$196,7,FALSE),0)","v":674402.79},{"$f":"IFERROR(VLOOKUP($A99,Awarded!$A$2:$J$196,8,FALSE),0)","v":0},{"$f":"IFERROR(VLOOKUP($A99,Awarded!$A$2:$J$196,9,FALSE),0)","v":1210895.04},{"$f":"IFERROR(VLOOKUP($A99,Awarded!$A$2:$J$196,10,FALSE),0)","v":302483.21000000002},{"$f":"IFERROR(VLOOKUP($A99,Expended!$A$2:$J$198,5,FALSE),0)","v":0},{"$f":"IFERROR(VLOOKUP($A99,Expended!$A$2:$J$198,6,FALSE),0)","v":120},{"$f":"IFERROR(VLOOKUP($A99,Expended!$A$2:$J$198,7,FALSE),0)","v":0},{"$f":"IFERROR(VLOOKUP($A99,Expended!$A$2:$J$198,8,FALSE),0)","v":1513.79},{"$f":"IFERROR(VLOOKUP($A99,Expended!$A$2:$J$198,9,FALSE),0)","v":0},{"$f":"IFERROR(VLOOKUP($A99,Expended!$A$2:$J$198,10,FALSE),0)","v":1037929.44},{"$f":"IFERROR(VLOOKUP($A99,Expended!$A$2:$L$198,11,FALSE),0)","v":0},{"$f":"VLOOKUP($A99,Prior!$A$1:$K$199,5,FALSE)","v":22203},{"$f":"VLOOKUP($A99,Prior!$A$1:$K$199,6,FALSE)","v":164905},{"$f":"VLOOKUP($A99,Prior!$A$1:$K$199,7,FALSE)","v":0},{"$f":"VLOOKUP($A99,Prior!$A$1:$K$199,8,FALSE)","v":672889},{"$f":"VLOOKUP($A99,Prior!$A$1:$K$199,9,FALSE)","v":0},{"$f":"VLOOKUP($A99,Prior!$A$1:$K$199,10,FALSE)","v":172965.6},{"$f":"VLOOKUP($A99,Prior!$A$1:$K$199,11,FALSE)","v":224641.8},{"$f":"D99-K99-R99","v":77.510000000002037},{"$f":"E99-L99-S99","v":49.339999999996508},{"$f":"F99-M99-T99","v":0},{"$f":"G99-N99-U99","v":0},{"$f":"H99-O99-V99","v":0},{"$f":"I99-P99-W99","v":0},{"$f":"J99-Q99-X99","v":77841.410000000033}]
[363,"MARSING JOINT DISTRICT",86812005,{"$f":"IFERROR(VLOOKUP($A100,Awarded!$A$2:$J$196,4,FALSE),0)","v":17448.55},{"$f":"IFERROR(VLOOKUP($A100,Awarded!$A$2:$J$196,5,FALSE),0)","v":228321.23},{"$f":"IFERROR(VLOOKUP($A100,Awarded!$A$2:$J$196,6,FALSE),0)","v":0},{"$f":"IFERROR(VLOOKUP($A100,Awarded!$A$2:$J$196,7,FALSE),0)","v":870296.49},{"$f":"IFERROR(VLOOKUP($A100,Awarded!$A$2:$J$196,8,FALSE),0)","v":0},{"$f":"IFERROR(VLOOKUP($A100,Awarded!$A$2:$J$196,9,FALSE),0)","v":1562624.58},{"$f":"IFERROR(VLOOKUP($A100,Awarded!$A$2:$J$196,10,FALSE),0)","v":390345.23},{"$f":"IFERROR(VLOOKUP($A100,Expended!$A$2:$J$198,5,FALSE),0)","v":62.55},{"$f":"IFERROR(VLOOKUP($A100,Expended!$A$2:$J$198,6,FALSE),0)","v":234.23},{"$f":"IFERROR(VLOOKUP($A100,Expended!$A$2:$J$198,7,FALSE),0)","v":0},{"$f":"IFERROR(VLOOKUP($A100,Expended!$A$2:$J$198,8,FALSE),0)","v":70686.34},{"$f":"IFERROR(VLOOKUP($A100,Expended!$A$2:$J$198,9,FALSE),0)","v":0},{"$f":"IFERROR(VLOOKUP($A100,Expended!$A$2:$J$198,10,FALSE),0)","v":583780.46},{"$f":"IFERROR(VLOOKUP($A100,Expended!$A$2:$L$198,11,FALSE),0)","v":47775.09},{"$f":"VLOOKUP($A100,Prior!$A$1:$K$199,5,FALSE)","v":17386},{"$f":"VLOOKUP($A100,Prior!$A$1:$K$199,6,FALSE)","v":228087},{"$f":"VLOOKUP($A100,Prior!$A$1:$K$199,7,FALSE)","v":0},{"$f":"VLOOKUP($A100,Prior!$A$1:$K$199,8,FALSE)","v":799610.14999999991},{"$f":"VLOOKUP($A100,Prior!$A$1:$K$199,9,FALSE)","v":0},{"$f":"VLOOKUP($A100,Prior!$A$1:$K$199,10,FALSE)","v":0},{"$f":"VLOOKUP($A100,Prior!$A$1:$K$199,11,FALSE)","v":0},0,0,0,0,0,978844.12000000011,342570.14]
[421,"MCCALL-DONNELLY JOINT SCHOOL DISTRICT",100599125,{"$f":"IFERROR(VLOOKUP($A101,Awarded!$A$2:$J$196,4,FALSE),0)","v":25387},{"$f":"IFERROR(VLOOKUP($A101,Awarded!$A$2:$J$196,5,FALSE),0)","v":104996.71},{"$f":"IFERROR(VLOOKUP($A101,Awarded!$A$2:$J$196,6,FALSE),0)","v":185843.21},{"$f":"IFERROR(VLOOKUP($A101,Awarded!$A$2:$J$196,7,FALSE),0)","v":364795.83},{"$f":"IFERROR(VLOOKUP($A101,Awarded!$A$2:$J$196,8,FALSE),0)","v":0},{"$f":"IFERROR(VLOOKUP($A101,Awarded!$A$2:$J$196,9,FALSE),0)","v":654993.93000000005},{"$f":"IFERROR(VLOOKUP($A101,Awarded!$A$2:$J$196,10,FALSE),0)","v":163618.62},{"$f":"IFERROR(VLOOKUP($A101,Expended!$A$2:$J$198,5,FALSE),0)","v":2606},{"$f":"IFERROR(VLOOKUP($A101,Expended!$A$2:$J$198,6,FALSE),0)","v":107.71},{"$f":"IFERROR(VLOOKUP($A101,Expended!$A$2:$J$198,7,FALSE),0)","v":64974.39},{"$f":"IFERROR(VLOOKUP($A101,Expended!$A$2:$J$198,8,FALSE),0)","v":112547.62},{"$f":"IFERROR(VLOOKUP($A101,Expended!$A$2:$J$198,9,FALSE),0)","v":0},{"$f":"IFERROR(VLOOKUP($A101,Expended!$A$2:$J$198,10,FALSE),0)","v":198057.59999999998},{"$f":"IFERROR(VLOOKUP($A101,Expended!$A$2:$L$198,11,FALSE),0)","v":29432.97},{"$f":"VLOOKUP($A101,Prior!$A$1:$K$199,5,FALSE)","v":22781},{"$f":"VLOOKUP($A101,Prior!$A$1:$K$199,6,FALSE)","v":104889},{"$f":"VLOOKUP($A101,Prior!$A$1:$K$199,7,FALSE)","v":120868.82},{"$f":"VLOOKUP($A101,Prior!$A$1:$K$199,8,FALSE)","v":252248.21},{"$f":"VLOOKUP($A101,Prior!$A$1:$K$199,9,FALSE)","v":0},{"$f":"VLOOKUP($A101,Prior!$A$1:$K$199,10,FALSE)","v":364682.36},{"$f":"VLOOKUP($A101,Prior!$A$1:$K$199,11,FALSE)","v":59077.83},0,0,0,0,0,92253.970000000088,75107.819999999992]
[11,"MEADOWS VALLEY DISTRICT",100015122,{"$f":"IFERROR(VLOOKUP($A102,Awarded!$A$2:$J$196,4,FALSE),0)","v":2377.4899999999998},{"$f":"IFERROR(VLOOKUP($A102,Awarded!$A$2:$J$196,5,FALSE),0)","v":43197.31},{"$f":"IFERROR(VLOOKUP($A102,Awarded!$A$2:$J$196,6,FALSE),0)","v":0},{"$f":"IFERROR(VLOOKUP($A102,Awarded!$A$2:$J$196,7,FALSE),0)","v":193897.23},{"$f":"IFERROR(VLOOKUP($A102,Awarded!$A$2:$J$196,8,FALSE),0)","v":0},{"$f":"IFERROR(VLOOKUP($A102,Awarded!$A$2:$J$196,9,FALSE),0)","v":348144.39},{"$f":"IFERROR(VLOOKUP($A102,Awarded!$A$2:$J$196,10,FALSE),0)","v":86966.69},{"$f":"IFERROR(VLOOKUP($A102,Expended!$A$2:$J$198,5,FALSE),0)","v":39.49},{"$f":"IFERROR(VLOOKUP($A102,Expended!$A$2:$J$198,6,FALSE),0)","v":44.6},{"$f":"IFERROR(VLOOKUP($A102,Expended!$A$2:$J$198,7,FALSE),0)","v":0},{"$f":"IFERROR(VLOOKUP($A102,Expended!$A$2:$J$198,8,FALSE),0)","v":102901.85},{"$f":"IFERROR(VLOOKUP($A102,Expended!$A$2:$J$198,9,FALSE),0)","v":0},{"$f":"IFERROR(VLOOKUP($A102,Expended!$A$2:$J$198,10,FALSE),0)","v":0},{"$f":"IFERROR(VLOOKUP($A102,Expended!$A$2:$L$198,11,FALSE),0)","v":18375.14},{"$f":"VLOOKUP($A102,Prior!$A$1:$K$199,5,FALSE)","v":2338},{"$f":"VLOOKUP($A102,Prior!$A$1:$K$199,6,FALSE)","v":43152.71},{"$f":"VLOOKUP($A102,Prior!$A$1:$K$199,7,FALSE)","v":0},{"$f":"VLOOKUP($A102,Prior!$A$1:$K$199,8,FALSE)","v":89684.88},{"$f":"VLOOKUP($A102,Prior!$A$1:$K$199,9,FALSE)","v":0},{"$f":"VLOOKUP($A102,Prior!$A$1:$K$199,10,FALSE)","v":0},{"$f":"VLOOKUP($A102,Prior!$A$1:$K$199,11,FALSE)","v":0},0,0,0,1310.5,0,348144.39,68591.55]
[136,"MELBA JOINT DISTRICT",184973659,{"$f":"IFERROR(VLOOKUP($A103,Awarded!$A$2:$J$196,4,FALSE),0)","v":17854.099999999999},{"$f":"IFERROR(VLOOKUP($A103,Awarded!$A$2:$J$196,5,FALSE),0)","v":95592.06},{"$f":"IFERROR(VLOOKUP($A103,Awarded!$A$2:$J$196,6,FALSE),0)","v":43283.31},{"$f":"IFERROR(VLOOKUP($A103,Awarded!$A$2:$J$196,7,FALSE),0)","v":382031.52},{"$f":"IFERROR(VLOOKUP($A103,Awarded!$A$2:$J$196,8,FALSE),0)","v":0},{"$f":"IFERROR(VLOOKUP($A103,Awarded!$A$2:$J$196,9,FALSE),0)","v":685939.79},{"$f":"IFERROR(VLOOKUP($A103,Awarded!$A$2:$J$196,10,FALSE),0)","v":171348.43},{"$f":"IFERROR(VLOOKUP($A103,Expended!$A$2:$J$198,5,FALSE),0)","v":638.1},{"$f":"IFERROR(VLOOKUP($A103,Expended!$A$2:$J$198,6,FALSE),0)","v":98.06},{"$f":"IFERROR(VLOOKUP($A103,Expended!$A$2:$J$198,7,FALSE),0)","v":885.31},{"$f":"IFERROR(VLOOKUP($A103,Expended!$A$2:$J$198,8,FALSE),0)","v":137076.52000000002},{"$f":"IFERROR(VLOOKUP($A103,Expended!$A$2:$J$198,9,FALSE),0)","v":0},{"$f":"IFERROR(VLOOKUP($A103,Expended!$A$2:$J$198,10,FALSE),0)","v":143222.37999999998},{"$f":"IFERROR(VLOOKUP($A103,Expended!$A$2:$L$198,11,FALSE),0)","v":41454.670000000013},{"$f":"VLOOKUP($A103,Prior!$A$1:$K$199,5,FALSE)","v":17216},{"$f":"VLOOKUP($A103,Prior!$A$1:$K$199,6,FALSE)","v":95494},{"$f":"VLOOKUP($A103,Prior!$A$1:$K$199,7,FALSE)","v":42398},{"$f":"VLOOKUP($A103,Prior!$A$1:$K$199,8,FALSE)","v":244955},{"$f":"VLOOKUP($A103,Prior!$A$1:$K$199,9,FALSE)","v":0},{"$f":"VLOOKUP($A103,Prior!$A$1:$K$199,10,FALSE)","v":0},{"$f":"VLOOKUP($A103,Prior!$A$1:$K$199,11,FALSE)","v":0},0,0,0,0,0,542717.41,129893.75999999998]
[785,"MERIDIAN MEDICAL ARTS CHARTER HIGH SCHOOL, INC.",67651558,{"$f":"IFERROR(VLOOKUP($A104,Awarded!$A$2:$J$196,4,FALSE),0)","v":10359.1},{"$f":"IFERROR(VLOOKUP($A104,Awarded!$A$2:$J$196,5,FALSE),0)","v":0},{"$f":"IFERROR(VLOOKUP($A104,Awarded!$A$2:$J$196,6,FALSE),0)","v":98899.88},{"$f":"IFERROR(VLOOKUP($A104,Awarded!$A$2:$J$196,7,FALSE),0)","v":0},{"$f":"IFERROR(VLOOKUP($A104,Awarded!$A$2:$J$196,8,FALSE),0)","v":0},{"$f":"IFERROR(VLOOKUP($A104,Awarded!$A$2:$J$196,9,FALSE),0)","v":0},{"$f":"IFERROR(VLOOKUP($A104,Awarded!$A$2:$J$196,10,FALSE),0)","v":0},{"$f":"IFERROR(VLOOKUP($A104,Expended!$A$2:$J$198,5,FALSE),0)","v":3332.3899999999994},{"$f":"IFERROR(VLOOKUP($A104,Expended!$A$2:$J$198,6,FALSE),0)","v":0},{"$f":"IFERROR(VLOOKUP($A104,Expended!$A$2:$J$198,7,FALSE),0)","v":23854.87},{"$f":"IFERROR(VLOOKUP($A104,Expended!$A$2:$J$198,8,FALSE),0)","v":0},{"$f":"IFERROR(VLOOKUP($A104,Expended!$A$2:$J$198,9,FALSE),0)","v":0},{"$f":"IFERROR(VLOOKUP($A104,Expended!$A$2:$J$198,10,FALSE),0)","v":0},{"$f":"IFERROR(VLOOKUP($A104,Expended!$A$2:$L$198,11,FALSE),0)","v":0},{"$f":"VLOOKUP($A104,Prior!$A$1:$K$199,5,FALSE)","v":7026.71},{"$f":"VLOOKUP($A104,Prior!$A$1:$K$199,6,FALSE)","v":0},{"$f":"VLOOKUP($A104,Prior!$A$1:$K$199,7,FALSE)","v":75045.009999999995},{"$f":"VLOOKUP($A104,Prior!$A$1:$K$199,8,FALSE)","v":0},{"$f":"VLOOKUP($A104,Prior!$A$1:$K$199,9,FALSE)","v":0},{"$f":"VLOOKUP($A104,Prior!$A$1:$K$199,10,FALSE)","v":0},{"$f":"VLOOKUP($A104,Prior!$A$1:$K$199,11,FALSE)","v":0},0,0,0,0,0,0,0]
[768,"MERIDIAN TECHNICAL CHARTER HIGH SCHOOL, INC.",44111453,{"$f":"IFERROR(VLOOKUP($A105,Awarded!$A$2:$J$196,4,FALSE),0)","v":10258.58},{"$f":"IFERROR(VLOOKUP($A105,Awarded!$A$2:$J$196,5,FALSE),0)","v":0},{"$f":"IFERROR(VLOOKUP($A105,Awarded!$A$2:$J$196,6,FALSE),0)","v":103914.45},{"$f":"IFERROR(VLOOKUP($A105,Awarded!$A$2:$J$196,7,FALSE),0)","v":0},{"$f":"IFERROR(VLOOKUP($A105,Awarded!$A$2:$J$196,8,FALSE),0)","v":0},{"$f":"IFERROR(VLOOKUP($A105,Awarded!$A$2:$J$196,9,FALSE),0)","v":0},{"$f":"IFERROR(VLOOKUP($A105,Awarded!$A$2:$J$196,10,FALSE),0)","v":0},{"$f":"IFERROR(VLOOKUP($A105,Expended!$A$2:$J$198,5,FALSE),0)","v":0},{"$f":"IFERROR(VLOOKUP($A105,Expended!$A$2:$J$198,6,FALSE),0)","v":0},{"$f":"IFERROR(VLOOKUP($A105,Expended!$A$2:$J$198,7,FALSE),0)","v":65450.310000000005},{"$f":"IFERROR(VLOOKUP($A105,Expended!$A$2:$J$198,8,FALSE),0)","v":0},{"$f":"IFERROR(VLOOKUP($A105,Expended!$A$2:$J$198,9,FALSE),0)","v":0},{"$f":"IFERROR(VLOOKUP($A105,Expended!$A$2:$J$198,10,FALSE),0)","v":0},{"$f":"IFERROR(VLOOKUP($A105,Expended!$A$2:$L$198,11,FALSE),0)","v":0},{"$f":"VLOOKUP($A105,Prior!$A$1:$K$199,5,FALSE)","v":9899},{"$f":"VLOOKUP($A105,Prior!$A$1:$K$199,6,FALSE)","v":0},{"$f":"VLOOKUP($A105,Prior!$A$1:$K$199,7,FALSE)","v":38464.14},{"$f":"VLOOKUP($A105,Prior!$A$1:$K$199,8,FALSE)","v":0},{"$f":"VLOOKUP($A105,Prior!$A$1:$K$199,9,FALSE)","v":0},{"$f":"VLOOKUP($A105,Prior!$A$1:$K$199,10,FALSE)","v":0},{"$f":"VLOOKUP($A105,Prior!$A$1:$K$199,11,FALSE)","v":0},359.57999999999993,0,0,0,0,0,0]
[134,"MIDDLETON DISTRICT",29646403,{"$f":"IFERROR(VLOOKUP($A106,Awarded!$A$2:$J$196,4,FALSE),0)","v":53767.369999999995},{"$f":"IFERROR(VLOOKUP($A106,Awarded!$A$2:$J$196,5,FALSE),0)","v":295050.68},{"$f":"IFERROR(VLOOKUP($A106,Awarded!$A$2:$J$196,6,FALSE),0)","v":458773.69},{"$f":"IFERROR(VLOOKUP($A106,Awarded!$A$2:$J$196,7,FALSE),0)","v":1134277.03},{"$f":"IFERROR(VLOOKUP($A106,Awarded!$A$2:$J$196,8,FALSE),0)","v":0},{"$f":"IFERROR(VLOOKUP($A106,Awarded!$A$2:$J$196,9,FALSE),0)","v":2036602.77},{"$f":"IFERROR(VLOOKUP($A106,Awarded!$A$2:$J$196,10,FALSE),0)","v":508746.37},{"$f":"IFERROR(VLOOKUP($A106,Expended!$A$2:$J$198,5,FALSE),0)","v":1947.3700000000001},{"$f":"IFERROR(VLOOKUP($A106,Expended!$A$2:$J$198,6,FALSE),0)","v":302.68},{"$f":"IFERROR(VLOOKUP($A106,Expended!$A$2:$J$198,7,FALSE),0)","v":9383.69},{"$f":"IFERROR(VLOOKUP($A106,Expended!$A$2:$J$198,8,FALSE),0)","v":235859.8},{"$f":"IFERROR(VLOOKUP($A106,Expended!$A$2:$J$198,9,FALSE),0)","v":0},{"$f":"IFERROR(VLOOKUP($A106,Expended!$A$2:$J$198,10,FALSE),0)","v":2207.5500000000002},{"$f":"IFERROR(VLOOKUP($A106,Expended!$A$2:$L$198,11,FALSE),0)","v":0},{"$f":"VLOOKUP($A106,Prior!$A$1:$K$199,5,FALSE)","v":51820},{"$f":"VLOOKUP($A106,Prior!$A$1:$K$199,6,FALSE)","v":294748},{"$f":"VLOOKUP($A106,Prior!$A$1:$K$199,7,FALSE)","v":449390},{"$f":"VLOOKUP($A106,Prior!$A$1:$K$199,8,FALSE)","v":0},{"$f":"VLOOKUP($A106,Prior!$A$1:$K$199,9,FALSE)","v":0},{"$f":"VLOOKUP($A106,Prior!$A$1:$K$199,10,FALSE)","v":0},{"$f":"VLOOKUP($A106,Prior!$A$1:$K$199,11,FALSE)","v":0},0,0,0,898417.23,0,2034395.22,508746.37]
[433,"MIDVALE DISTRICT",183894732,{"$f":"IFERROR(VLOOKUP($A107,Awarded!$A$2:$J$196,4,FALSE),0)","v":2289.81},{"$f":"IFERROR(VLOOKUP($A107,Awarded!$A$2:$J$196,5,FALSE),0)","v":27476.19},{"$f":"IFERROR(VLOOKUP($A107,Awarded!$A$2:$J$196,6,FALSE),0)","v":7617.81},{"$f":"IFERROR(VLOOKUP($A107,Awarded!$A$2:$J$196,7,FALSE),0)","v":109807.48},{"$f":"IFERROR(VLOOKUP($A107,Awarded!$A$2:$J$196,8,FALSE),0)","v":103944},{"$f":"IFERROR(VLOOKUP($A107,Awarded!$A$2:$J$196,9,FALSE),0)","v":197160.45},{"$f":"IFERROR(VLOOKUP($A107,Awarded!$A$2:$J$196,10,FALSE),0)","v":49250.94},{"$f":"IFERROR(VLOOKUP($A107,Expended!$A$2:$J$198,5,FALSE),0)","v":0},{"$f":"IFERROR(VLOOKUP($A107,Expended!$A$2:$J$198,6,FALSE),0)","v":0},{"$f":"IFERROR(VLOOKUP($A107,Expended!$A$2:$J$198,7,FALSE),0)","v":155.81},{"$f":"IFERROR(VLOOKUP($A107,Expended!$A$2:$J$198,8,FALSE),0)","v":1769.63},{"$f":"IFERROR(VLOOKUP($A107,Expended!$A$2:$J$198,9,FALSE),0)","v":0},{"$f":"IFERROR(VLOOKUP($A107,Expended!$A$2:$J$198,10,FALSE),0)","v":13855},{"$f":"IFERROR(VLOOKUP($A107,Expended!$A$2:$L$198,11,FALSE),0)","v":18758.82},{"$f":"VLOOKUP($A107,Prior!$A$1:$K$199,5,FALSE)","v":2250},{"$f":"VLOOKUP($A107,Prior!$A$1:$K$199,6,FALSE)","v":27448},{"$f":"VLOOKUP($A107,Prior!$A$1:$K$199,7,FALSE)","v":7462},{"$f":"VLOOKUP($A107,Prior!$A$1:$K$199,8,FALSE)","v":108037.84999999999},{"$f":"VLOOKUP($A107,Prior!$A$1:$K$199,9,FALSE)","v":0},{"$f":"VLOOKUP($A107,Prior!$A$1:$K$199,10,FALSE)","v":168704.52},{"$f":"VLOOKUP($A107,Prior!$A$1:$K$199,11,FALSE)","v":5399.89},39.809999999999945,28.18999999999869,0,0,103944,14600.930000000022,25092.230000000003]
[331,"MINIDOKA COUNTY JOINT DISTRICT",100015171,{"$f":"IFERROR(VLOOKUP($A108,Awarded!$A$2:$J$196,4,FALSE),0)","v":58755},{"$f":"IFERROR(VLOOKUP($A108,Awarded!$A$2:$J$196,5,FALSE),0)","v":636068.52},{"$f":"IFERROR(VLOOKUP($A108,Awarded!$A$2:$J$196,6,FALSE),0)","v":0},{"$f":"IFERROR(VLOOKUP($A108,Awarded!$A$2:$J$196,7,FALSE),0)","v":2542021.9},{"$f":"IFERROR(VLOOKUP($A108,Awarded!$A$2:$J$196,8,FALSE),0)","v":0},{"$f":"IFERROR(VLOOKUP($A108,Awarded!$A$2:$J$196,9,FALSE),0)","v":4564219.4800000004},{"$f":"IFERROR(VLOOKUP($A108,Awarded!$A$2:$J$196,10,FALSE),0)","v":1140148.42},{"$f":"IFERROR(VLOOKUP($A108,Expended!$A$2:$J$198,5,FALSE),0)","v":2606},{"$f":"IFERROR(VLOOKUP($A108,Expended!$A$2:$J$198,6,FALSE),0)","v":652.52},{"$f":"IFERROR(VLOOKUP($A108,Expended!$A$2:$J$198,7,FALSE),0)","v":0},{"$f":"IFERROR(VLOOKUP($A108,Expended!$A$2:$J$198,8,FALSE),0)","v":376928.55},{"$f":"IFERROR(VLOOKUP($A108,Expended!$A$2:$J$198,9,FALSE),0)","v":0},{"$f":"IFERROR(VLOOKUP($A108,Expended!$A$2:$J$198,10,FALSE),0)","v":2173499.4300000002},{"$f":"IFERROR(VLOOKUP($A108,Expended!$A$2:$L$198,11,FALSE),0)","v":280671.55},{"$f":"VLOOKUP($A108,Prior!$A$1:$K$199,5,FALSE)","v":56149},{"$f":"VLOOKUP($A108,Prior!$A$1:$K$199,6,FALSE)","v":635416},{"$f":"VLOOKUP($A108,Prior!$A$1:$K$199,7,FALSE)","v":0},{"$f":"VLOOKUP($A108,Prior!$A$1:$K$199,8,FALSE)","v":2137633.79},{"$f":"VLOOKUP($A108,Prior!$A$1:$K$199,9,FALSE)","v":0},{"$f":"VLOOKUP($A108,Prior!$A$1:$K$199,10,FALSE)","v":0},{"$f":"VLOOKUP($A108,Prior!$A$1:$K$199,11,FALSE)","v":842508},0,0,0,27459.560000000056,0,2390720.0500000003,16968.869999999879]
[474,"MONTICELLO MONTESSORI CHARTER SCHOOL, INC.",961942005,{"$f":"IFERROR(VLOOKUP($A109,Awarded!$A$2:$J$196,4,FALSE),0)","v":5762.29},{"$f":"IFERROR(VLOOKUP($A109,Awarded!$A$2:$J$196,5,FALSE),0)","v":36724.67},{"$f":"IFERROR(VLOOKUP($A109,Awarded!$A$2:$J$196,6,FALSE),0)","v":0},{"$f":"IFERROR(VLOOKUP($A109,Awarded!$A$2:$J$196,7,FALSE),0)","v":162291.28},{"$f":"IFERROR(VLOOKUP($A109,Awarded!$A$2:$J$196,8,FALSE),0)","v":0},{"$f":"IFERROR(VLOOKUP($A109,Awarded!$A$2:$J$196,9,FALSE),0)","v":291394.63},{"$f":"IFERROR(VLOOKUP($A109,Awarded!$A$2:$J$196,10,FALSE),0)","v":72790.52},{"$f":"IFERROR(VLOOKUP($A109,Expended!$A$2:$J$198,5,FALSE),0)","v":3196.29},{"$f":"IFERROR(VLOOKUP($A109,Expended!$A$2:$J$198,6,FALSE),0)","v":37.67},{"$f":"IFERROR(VLOOKUP($A109,Expended!$A$2:$J$198,7,FALSE),0)","v":0},{"$f":"IFERROR(VLOOKUP($A109,Expended!$A$2:$J$198,8,FALSE),0)","v":32622.280000000002},{"$f":"IFERROR(VLOOKUP($A109,Expended!$A$2:$J$198,9,FALSE),0)","v":0},{"$f":"IFERROR(VLOOKUP($A109,Expended!$A$2:$J$198,10,FALSE),0)","v":136276.94},{"$f":"IFERROR(VLOOKUP($A109,Expended!$A$2:$L$198,11,FALSE),0)","v":14932.259999999998},{"$f":"VLOOKUP($A109,Prior!$A$1:$K$199,5,FALSE)","v":2566},{"$f":"VLOOKUP($A109,Prior!$A$1:$K$199,6,FALSE)","v":36687},{"$f":"VLOOKUP($A109,Prior!$A$1:$K$199,7,FALSE)","v":0},{"$f":"VLOOKUP($A109,Prior!$A$1:$K$199,8,FALSE)","v":126571.04},{"$f":"VLOOKUP($A109,Prior!$A$1:$K$199,9,FALSE)","v":0},{"$f":"VLOOKUP($A109,Prior!$A$1:$K$199,10,FALSE)","v":100482.12999999999},{"$f":"VLOOKUP($A109,Prior!$A$1:$K$199,11,FALSE)","v":162.4},0,0,0,3097.9600000000064,0,54635.560000000012,57695.860000000008]
[544,"MOSAICS PUBLIC SCHOOL, INC.",117130660,{"$f":"IFERROR(VLOOKUP($A110,Awarded!$A$2:$J$196,4,FALSE),0)","v":11310},{"$f":"IFERROR(VLOOKUP($A110,Awarded!$A$2:$J$196,5,FALSE),0)","v":18330.8},{"$f":"IFERROR(VLOOKUP($A110,Awarded!$A$2:$J$196,6,FALSE),0)","v":0},{"$f":"IFERROR(VLOOKUP($A110,Awarded!$A$2:$J$196,7,FALSE),0)","v":132369.12},{"$f":"IFERROR(VLOOKUP($A110,Awarded!$A$2:$J$196,8,FALSE),0)","v":93259},{"$f":"IFERROR(VLOOKUP($A110,Awarded!$A$2:$J$196,9,FALSE),0)","v":237670.38},{"$f":"IFERROR(VLOOKUP($A110,Awarded!$A$2:$J$196,10,FALSE),0)","v":59370.63},{"$f":"IFERROR(VLOOKUP($A110,Expended!$A$2:$J$198,5,FALSE),0)","v":23},{"$f":"IFERROR(VLOOKUP($A110,Expended!$A$2:$J$198,6,FALSE),0)","v":18.8},{"$f":"IFERROR(VLOOKUP($A110,Expended!$A$2:$J$198,7,FALSE),0)","v":0},{"$f":"IFERROR(VLOOKUP($A110,Expended!$A$2:$J$198,8,FALSE),0)","v":40639.300000000003},{"$f":"IFERROR(VLOOKUP($A110,Expended!$A$2:$J$198,9,FALSE),0)","v":0},{"$f":"IFERROR(VLOOKUP($A110,Expended!$A$2:$J$198,10,FALSE),0)","v":126291.75},{"$f":"IFERROR(VLOOKUP($A110,Expended!$A$2:$L$198,11,FALSE),0)","v":26294.65},{"$f":"VLOOKUP($A110,Prior!$A$1:$K$199,5,FALSE)","v":11287},{"$f":"VLOOKUP($A110,Prior!$A$1:$K$199,6,FALSE)","v":18312},{"$f":"VLOOKUP($A110,Prior!$A$1:$K$199,7,FALSE)","v":0},{"$f":"VLOOKUP($A110,Prior!$A$1:$K$199,8,FALSE)","v":91729.819999999992},{"$f":"VLOOKUP($A110,Prior!$A$1:$K$199,9,FALSE)","v":0},{"$f":"VLOOKUP($A110,Prior!$A$1:$K$199,10,FALSE)","v":0},{"$f":"VLOOKUP($A110,Prior!$A$1:$K$199,11,FALSE)","v":0},0,0,0,0,93259,111378.63,33075.979999999996]
[813,"MOSCOW CHARTER SCHOOL, INC.",93632698,{"$f":"IFERROR(VLOOKUP($A111,Awarded!$A$2:$J$196,4,FALSE),0)","v":2408},{"$f":"IFERROR(VLOOKUP($A111,Awarded!$A$2:$J$196,5,FALSE),0)","v":0},{"$f":"IFERROR(VLOOKUP($A111,Awarded!$A$2:$J$196,6,FALSE),0)","v":68148.91},{"$f":"IFERROR(VLOOKUP($A111,Awarded!$A$2:$J$196,7,FALSE),0)","v":0},{"$f":"IFERROR(VLOOKUP($A111,Awarded!$A$2:$J$196,8,FALSE),0)","v":0},{"$f":"IFERROR(VLOOKUP($A111,Awarded!$A$2:$J$196,9,FALSE),0)","v":0},{"$f":"IFERROR(VLOOKUP($A111,Awarded!$A$2:$J$196,10,FALSE),0)","v":0},{"$f":"IFERROR(VLOOKUP($A111,Expended!$A$2:$J$198,5,FALSE),0)","v":0},{"$f":"IFERROR(VLOOKUP($A111,Expended!$A$2:$J$198,6,FALSE),0)","v":0},{"$f":"IFERROR(VLOOKUP($A111,Expended!$A$2:$J$198,7,FALSE),0)","v":25565.149999999998},{"$f":"IFERROR(VLOOKUP($A111,Expended!$A$2:$J$198,8,FALSE),0)","v":0},{"$f":"IFERROR(VLOOKUP($A111,Expended!$A$2:$J$198,9,FALSE),0)","v":0},{"$f":"IFERROR(VLOOKUP($A111,Expended!$A$2:$J$198,10,FALSE),0)","v":0},{"$f":"IFERROR(VLOOKUP($A111,Expended!$A$2:$L$198,11,FALSE),0)","v":0},{"$f":"VLOOKUP($A111,Prior!$A$1:$K$199,5,FALSE)","v":2408},{"$f":"VLOOKUP($A111,Prior!$A$1:$K$199,6,FALSE)","v":0},{"$f":"VLOOKUP($A111,Prior!$A$1:$K$199,7,FALSE)","v":41189.85},{"$f":"VLOOKUP($A111,Prior!$A$1:$K$199,8,FALSE)","v":0},{"$f":"VLOOKUP($A111,Prior!$A$1:$K$199,9,FALSE)","v":0},{"$f":"VLOOKUP($A111,Prior!$A$1:$K$199,10,FALSE)","v":0},{"$f":"VLOOKUP($A111,Prior!$A$1:$K$199,11,FALSE)","v":0},0,0,1393.9100000000108,0,0,0,0]
[281,"MOSCOW DISTRICT",29785391,{"$f":"IFERROR(VLOOKUP($A112,Awarded!$A$2:$J$196,4,FALSE),0)","v":34076.6},{"$f":"IFERROR(VLOOKUP($A112,Awarded!$A$2:$J$196,5,FALSE),0)","v":284049.39},{"$f":"IFERROR(VLOOKUP($A112,Awarded!$A$2:$J$196,6,FALSE),0)","v":0},{"$f":"IFERROR(VLOOKUP($A112,Awarded!$A$2:$J$196,7,FALSE),0)","v":1135193.0900000001},{"$f":"IFERROR(VLOOKUP($A112,Awarded!$A$2:$J$196,8,FALSE),0)","v":0},{"$f":"IFERROR(VLOOKUP($A112,Awarded!$A$2:$J$196,9,FALSE),0)","v":2038247.68},{"$f":"IFERROR(VLOOKUP($A112,Awarded!$A$2:$J$196,10,FALSE),0)","v":509157.52},{"$f":"IFERROR(VLOOKUP($A112,Expended!$A$2:$J$198,5,FALSE),0)","v":8811.6},{"$f":"IFERROR(VLOOKUP($A112,Expended!$A$2:$J$198,6,FALSE),0)","v":291.39},{"$f":"IFERROR(VLOOKUP($A112,Expended!$A$2:$J$198,7,FALSE),0)","v":0},{"$f":"IFERROR(VLOOKUP($A112,Expended!$A$2:$J$198,8,FALSE),0)","v":130011.84},{"$f":"IFERROR(VLOOKUP($A112,Expended!$A$2:$J$198,9,FALSE),0)","v":0},{"$f":"IFERROR(VLOOKUP($A112,Expended!$A$2:$J$198,10,FALSE),0)","v":307428.57999999996},{"$f":"IFERROR(VLOOKUP($A112,Expended!$A$2:$L$198,11,FALSE),0)","v":177935.94},{"$f":"VLOOKUP($A112,Prior!$A$1:$K$199,5,FALSE)","v":25265},{"$f":"VLOOKUP($A112,Prior!$A$1:$K$199,6,FALSE)","v":283757.78999999998},{"$f":"VLOOKUP($A112,Prior!$A$1:$K$199,7,FALSE)","v":0},{"$f":"VLOOKUP($A112,Prior!$A$1:$K$199,8,FALSE)","v":841189.48},{"$f":"VLOOKUP($A112,Prior!$A$1:$K$199,9,FALSE)","v":0},{"$f":"VLOOKUP($A112,Prior!$A$1:$K$199,10,FALSE)","v":41999.08},{"$f":"VLOOKUP($A112,Prior!$A$1:$K$199,11,FALSE)","v":82331.459999999992},0,0.21000000002095476,0,163991.77000000014,0,1688820.02,248890.12000000002]
[193,"MOUNTAIN HOME DISTRICT",127655744,{"$f":"IFERROR(VLOOKUP($A113,Awarded!$A$2:$J$196,4,FALSE),0)","v":50416.18},{"$f":"IFERROR(VLOOKUP($A113,Awarded!$A$2:$J$196,5,FALSE),0)","v":634594},{"$f":"IFERROR(VLOOKUP($A113,Awarded!$A$2:$J$196,6,FALSE),0)","v":0},{"$f":"IFERROR(VLOOKUP($A113,Awarded!$A$2:$J$196,7,FALSE),0)","v":2953935.5},{"$f":"IFERROR(VLOOKUP($A113,Awarded!$A$2:$J$196,8,FALSE),0)","v":0},{"$f":"IFERROR(VLOOKUP($A113,Awarded!$A$2:$J$196,9,FALSE),0)","v":5303813.43},{"$f":"IFERROR(VLOOKUP($A113,Awarded!$A$2:$J$196,10,FALSE),0)","v":1324899.74},{"$f":"IFERROR(VLOOKUP($A113,Expended!$A$2:$J$198,5,FALSE),0)","v":189.18},{"$f":"IFERROR(VLOOKUP($A113,Expended!$A$2:$J$198,6,FALSE),0)","v":651},{"$f":"IFERROR(VLOOKUP($A113,Expended!$A$2:$J$198,7,FALSE),0)","v":0},{"$f":"IFERROR(VLOOKUP($A113,Expended!$A$2:$J$198,8,FALSE),0)","v":987226.88},{"$f":"IFERROR(VLOOKUP($A113,Expended!$A$2:$J$198,9,FALSE),0)","v":0},{"$f":"IFERROR(VLOOKUP($A113,Expended!$A$2:$J$198,10,FALSE),0)","v":3364581.4},{"$f":"IFERROR(VLOOKUP($A113,Expended!$A$2:$L$198,11,FALSE),0)","v":387233.95999999996},{"$f":"VLOOKUP($A113,Prior!$A$1:$K$199,5,FALSE)","v":50227},{"$f":"VLOOKUP($A113,Prior!$A$1:$K$199,6,FALSE)","v":633943},{"$f":"VLOOKUP($A113,Prior!$A$1:$K$199,7,FALSE)","v":0},{"$f":"VLOOKUP($A113,Prior!$A$1:$K$199,8,FALSE)","v":655600.48},{"$f":"VLOOKUP($A113,Prior!$A$1:$K$199,9,FALSE)","v":0},{"$f":"VLOOKUP($A113,Prior!$A$1:$K$199,10,FALSE)","v":0},{"$f":"VLOOKUP($A113,Prior!$A$1:$K$199,11,FALSE)","v":750563.01},0,0,0,1311108.1400000001,0,1939232.0299999998,187102.77000000002]
[244,"MOUNTAIN VIEW SCHOOL DISTRICT",76641414,{"$f":"IFERROR(VLOOKUP($A114,Awarded!$A$2:$J$196,4,FALSE),0)","v":10192.040000000001},{"$f":"IFERROR(VLOOKUP($A114,Awarded!$A$2:$J$196,5,FALSE),0)","v":206283.62},{"$f":"IFERROR(VLOOKUP($A114,Awarded!$A$2:$J$196,6,FALSE),0)","v":0},{"$f":"IFERROR(VLOOKUP($A114,Awarded!$A$2:$J$196,7,FALSE),0)","v":845885.7},{"$f":"IFERROR(VLOOKUP($A114,Awarded!$A$2:$J$196,8,FALSE),0)","v":0},{"$f":"IFERROR(VLOOKUP($A114,Awarded!$A$2:$J$196,9,FALSE),0)","v":1518794.8},{"$f":"IFERROR(VLOOKUP($A114,Awarded!$A$2:$J$196,10,FALSE),0)","v":379397.24},{"$f":"IFERROR(VLOOKUP($A114,Expended!$A$2:$J$198,5,FALSE),0)","v":2835.18},{"$f":"IFERROR(VLOOKUP($A114,Expended!$A$2:$J$198,6,FALSE),0)","v":211.62},{"$f":"IFERROR(VLOOKUP($A114,Expended!$A$2:$J$198,7,FALSE),0)","v":0},{"$f":"IFERROR(VLOOKUP($A114,Expended!$A$2:$J$198,8,FALSE),0)","v":405436.41000000003},{"$f":"IFERROR(VLOOKUP($A114,Expended!$A$2:$J$198,9,FALSE),0)","v":0},{"$f":"IFERROR(VLOOKUP($A114,Expended!$A$2:$J$198,10,FALSE),0)","v":198806.55000000002},{"$f":"IFERROR(VLOOKUP($A114,Expended!$A$2:$L$198,11,FALSE),0)","v":310797.87},{"$f":"VLOOKUP($A114,Prior!$A$1:$K$199,5,FALSE)","v":7356.86},{"$f":"VLOOKUP($A114,Prior!$A$1:$K$199,6,FALSE)","v":206072},{"$f":"VLOOKUP($A114,Prior!$A$1:$K$199,7,FALSE)","v":0},{"$f":"VLOOKUP($A114,Prior!$A$1:$K$199,8,FALSE)","v":440449.29000000004},{"$f":"VLOOKUP($A114,Prior!$A$1:$K$199,9,FALSE)","v":0},{"$f":"VLOOKUP($A114,Prior!$A$1:$K$199,10,FALSE)","v":134828.95000000001},{"$f":"VLOOKUP($A114,Prior!$A$1:$K$199,11,FALSE)","v":0},0,0,0,0,0,1185159.3,68599.37]
[392,"MULLAN DISTRICT",100015197,{"$f":"IFERROR(VLOOKUP($A115,Awarded!$A$2:$J$196,4,FALSE),0)","v":9139.84},{"$f":"IFERROR(VLOOKUP($A115,Awarded!$A$2:$J$196,5,FALSE),0)","v":43537.66},{"$f":"IFERROR(VLOOKUP($A115,Awarded!$A$2:$J$196,6,FALSE),0)","v":0},{"$f":"IFERROR(VLOOKUP($A115,Awarded!$A$2:$J$196,7,FALSE),0)","v":201289.82},{"$f":"IFERROR(VLOOKUP($A115,Awarded!$A$2:$J$196,8,FALSE),0)","v":0},{"$f":"IFERROR(VLOOKUP($A115,Awarded!$A$2:$J$196,9,FALSE),0)","v":361417.77},{"$f":"IFERROR(VLOOKUP($A115,Awarded!$A$2:$J$196,10,FALSE),0)","v":90282.9},{"$f":"IFERROR(VLOOKUP($A115,Expended!$A$2:$J$198,5,FALSE),0)","v":1222.6299999999999},{"$f":"IFERROR(VLOOKUP($A115,Expended!$A$2:$J$198,6,FALSE),0)","v":44.66},{"$f":"IFERROR(VLOOKUP($A115,Expended!$A$2:$J$198,7,FALSE),0)","v":0},{"$f":"IFERROR(VLOOKUP($A115,Expended!$A$2:$J$198,8,FALSE),0)","v":101070.58000000002},{"$f":"IFERROR(VLOOKUP($A115,Expended!$A$2:$J$198,9,FALSE),0)","v":0},{"$f":"IFERROR(VLOOKUP($A115,Expended!$A$2:$J$198,10,FALSE),0)","v":0},{"$f":"IFERROR(VLOOKUP($A115,Expended!$A$2:$L$198,11,FALSE),0)","v":0},{"$f":"VLOOKUP($A115,Prior!$A$1:$K$199,5,FALSE)","v":7917.21},{"$f":"VLOOKUP($A115,Prior!$A$1:$K$199,6,FALSE)","v":43493},{"$f":"VLOOKUP($A115,Prior!$A$1:$K$199,7,FALSE)","v":0},{"$f":"VLOOKUP($A115,Prior!$A$1:$K$199,8,FALSE)","v":54880.83},{"$f":"VLOOKUP($A115,Prior!$A$1:$K$199,9,FALSE)","v":0},{"$f":"VLOOKUP($A115,Prior!$A$1:$K$199,10,FALSE)","v":0},{"$f":"VLOOKUP($A115,Prior!$A$1:$K$199,11,FALSE)","v":0},0,0,0,45338.409999999989,0,361417.77,90282.9]
[418,"MURTAUGH JOINT DISTRICT",192846512,{"$f":"IFERROR(VLOOKUP($A116,Awarded!$A$2:$J$196,4,FALSE),0)","v":12191.18},{"$f":"IFERROR(VLOOKUP($A116,Awarded!$A$2:$J$196,5,FALSE),0)","v":33043.9},{"$f":"IFERROR(VLOOKUP($A116,Awarded!$A$2:$J$196,6,FALSE),0)","v":44684.98},{"$f":"IFERROR(VLOOKUP($A116,Awarded!$A$2:$J$196,7,FALSE),0)","v":154800.47},{"$f":"IFERROR(VLOOKUP($A116,Awarded!$A$2:$J$196,8,FALSE),0)","v":3526},{"$f":"IFERROR(VLOOKUP($A116,Awarded!$A$2:$J$196,9,FALSE),0)","v":277944.05},{"$f":"IFERROR(VLOOKUP($A116,Awarded!$A$2:$J$196,10,FALSE),0)","v":69431.3},{"$f":"IFERROR(VLOOKUP($A116,Expended!$A$2:$J$198,5,FALSE),0)","v":526.18000000000006},{"$f":"IFERROR(VLOOKUP($A116,Expended!$A$2:$J$198,6,FALSE),0)","v":33.9},{"$f":"IFERROR(VLOOKUP($A116,Expended!$A$2:$J$198,7,FALSE),0)","v":913.98},{"$f":"IFERROR(VLOOKUP($A116,Expended!$A$2:$J$198,8,FALSE),0)","v":347.47},{"$f":"IFERROR(VLOOKUP($A116,Expended!$A$2:$J$198,9,FALSE),0)","v":3526},{"$f":"IFERROR(VLOOKUP($A116,Expended!$A$2:$J$198,10,FALSE),0)","v":140548.85},{"$f":"IFERROR(VLOOKUP($A116,Expended!$A$2:$L$198,11,FALSE),0)","v":40185.629999999997},{"$f":"VLOOKUP($A116,Prior!$A$1:$K$199,5,FALSE)","v":11665},{"$f":"VLOOKUP($A116,Prior!$A$1:$K$199,6,FALSE)","v":33010},{"$f":"VLOOKUP($A116,Prior!$A$1:$K$199,7,FALSE)","v":43771},{"$f":"VLOOKUP($A116,Prior!$A$1:$K$199,8,FALSE)","v":154453},{"$f":"VLOOKUP($A116,Prior!$A$1:$K$199,9,FALSE)","v":0},{"$f":"VLOOKUP($A116,Prior!$A$1:$K$199,10,FALSE)","v":11325.150000000001},{"$f":"VLOOKUP($A116,Prior!$A$1:$K$199,11,FALSE)","v":0},0,0,0,0,0,126070.04999999999,29245.670000000006]
[131,"NAMPA SCHOOL DISTRICT",29646478,{"$f":"IFERROR(VLOOKUP($A117,Awarded!$A$2:$J$196,4,FALSE),0)","v":165115.23000000001},{"$f":"IFERROR(VLOOKUP($A117,Awarded!$A$2:$J$196,5,FALSE),0)","v":3419131.55},{"$f":"IFERROR(VLOOKUP($A117,Awarded!$A$2:$J$196,6,FALSE),0)","v":0},{"$f":"IFERROR(VLOOKUP($A117,Awarded!$A$2:$J$196,7,FALSE),0)","v":11974747.890000001},{"$f":"IFERROR(VLOOKUP($A117,Awarded!$A$2:$J$196,8,FALSE),0)","v":0},{"$f":"IFERROR(VLOOKUP($A117,Awarded!$A$2:$J$196,9,FALSE),0)","v":21500750.52},{"$f":"IFERROR(VLOOKUP($A117,Awarded!$A$2:$J$196,10,FALSE),0)","v":5370916.9299999997},{"$f":"IFERROR(VLOOKUP($A117,Expended!$A$2:$J$198,5,FALSE),0)","v":1342.56},{"$f":"IFERROR(VLOOKUP($A117,Expended!$A$2:$J$198,6,FALSE),0)","v":7397.5300000000007},{"$f":"IFERROR(VLOOKUP($A117,Expended!$A$2:$J$198,7,FALSE),0)","v":0},{"$f":"IFERROR(VLOOKUP($A117,Expended!$A$2:$J$198,8,FALSE),0)","v":4067279.6199999996},{"$f":"IFERROR(VLOOKUP($A117,Expended!$A$2:$J$198,9,FALSE),0)","v":0},{"$f":"IFERROR(VLOOKUP($A117,Expended!$A$2:$J$198,10,FALSE),0)","v":6985000.2100000009},{"$f":"IFERROR(VLOOKUP($A117,Expended!$A$2:$L$198,11,FALSE),0)","v":1358981.7100000002},{"$f":"VLOOKUP($A117,Prior!$A$1:$K$199,5,FALSE)","v":163772.67000000001},{"$f":"VLOOKUP($A117,Prior!$A$1:$K$199,6,FALSE)","v":3411509.79},{"$f":"VLOOKUP($A117,Prior!$A$1:$K$199,7,FALSE)","v":0},{"$f":"VLOOKUP($A117,Prior!$A$1:$K$199,8,FALSE)","v":7905900.870000001},{"$f":"VLOOKUP($A117,Prior!$A$1:$K$199,9,FALSE)","v":0},{"$f":"VLOOKUP($A117,Prior!$A$1:$K$199,10,FALSE)","v":1411838.9200000002},{"$f":"VLOOKUP($A117,Prior!$A$1:$K$199,11,FALSE)","v":1088758.53},0,224.22999999998137,0,1567.4000000003725,0,13103911.389999999,2923176.6899999995]
[372,"NEW PLYMOUTH DISTRICT",29880812,{"$f":"IFERROR(VLOOKUP($A118,Awarded!$A$2:$J$196,4,FALSE),0)","v":18268},{"$f":"IFERROR(VLOOKUP($A118,Awarded!$A$2:$J$196,5,FALSE),0)","v":158924.03},{"$f":"IFERROR(VLOOKUP($A118,Awarded!$A$2:$J$196,6,FALSE),0)","v":0},{"$f":"IFERROR(VLOOKUP($A118,Awarded!$A$2:$J$196,7,FALSE),0)","v":616089.89},{"$f":"IFERROR(VLOOKUP($A118,Awarded!$A$2:$J$196,8,FALSE),0)","v":0},{"$f":"IFERROR(VLOOKUP($A118,Awarded!$A$2:$J$196,9,FALSE),0)","v":1106193.73},{"$f":"IFERROR(VLOOKUP($A118,Awarded!$A$2:$J$196,10,FALSE),0)","v":276328.68},{"$f":"IFERROR(VLOOKUP($A118,Expended!$A$2:$J$198,5,FALSE),0)","v":0},{"$f":"IFERROR(VLOOKUP($A118,Expended!$A$2:$J$198,6,FALSE),0)","v":0},{"$f":"IFERROR(VLOOKUP($A118,Expended!$A$2:$J$198,7,FALSE),0)","v":0},{"$f":"IFERROR(VLOOKUP($A118,Expended!$A$2:$J$198,8,FALSE),0)","v":196936.90000000002},{"$f":"IFERROR(VLOOKUP($A118,Expended!$A$2:$J$198,9,FALSE),0)","v":0},{"$f":"IFERROR(VLOOKUP($A118,Expended!$A$2:$J$198,10,FALSE),0)","v":560534.48},{"$f":"IFERROR(VLOOKUP($A118,Expended!$A$2:$L$198,11,FALSE),0)","v":224720.29},{"$f":"VLOOKUP($A118,Prior!$A$1:$K$199,5,FALSE)","v":18268},{"$f":"VLOOKUP($A118,Prior!$A$1:$K$199,6,FALSE)","v":158761},{"$f":"VLOOKUP($A118,Prior!$A$1:$K$199,7,FALSE)","v":0},{"$f":"VLOOKUP($A118,Prior!$A$1:$K$199,8,FALSE)","v":419152.99},{"$f":"VLOOKUP($A118,Prior!$A$1:$K$199,9,FALSE)","v":0},{"$f":"VLOOKUP($A118,Prior!$A$1:$K$199,10,FALSE)","v":23371.79},{"$f":"VLOOKUP($A118,Prior!$A$1:$K$199,11,FALSE)","v":10253.780000000001},0,163.02999999999884,0,0,0,522287.46,41354.609999999986]
[302,"NEZPERCE JOINT DISTRICT",794728741,{"$f":"IFERROR(VLOOKUP($A119,Awarded!$A$2:$J$196,4,FALSE),0)","v":9926.18},{"$f":"IFERROR(VLOOKUP($A119,Awarded!$A$2:$J$196,5,FALSE),0)","v":18084.55},{"$f":"IFERROR(VLOOKUP($A119,Awarded!$A$2:$J$196,6,FALSE),0)","v":36302.53},{"$f":"IFERROR(VLOOKUP($A119,Awarded!$A$2:$J$196,7,FALSE),0)","v":72277.240000000005},{"$f":"IFERROR(VLOOKUP($A119,Awarded!$A$2:$J$196,8,FALSE),0)","v":187750},{"$f":"IFERROR(VLOOKUP($A119,Awarded!$A$2:$J$196,9,FALSE),0)","v":129773.37},{"$f":"IFERROR(VLOOKUP($A119,Awarded!$A$2:$J$196,10,FALSE),0)","v":32417.81},{"$f":"IFERROR(VLOOKUP($A119,Expended!$A$2:$J$198,5,FALSE),0)","v":460.18},{"$f":"IFERROR(VLOOKUP($A119,Expended!$A$2:$J$198,6,FALSE),0)","v":18.55},{"$f":"IFERROR(VLOOKUP($A119,Expended!$A$2:$J$198,7,FALSE),0)","v":36302.53},{"$f":"IFERROR(VLOOKUP($A119,Expended!$A$2:$J$198,8,FALSE),0)","v":72277.240000000005},{"$f":"IFERROR(VLOOKUP($A119,Expended!$A$2:$J$198,9,FALSE),0)","v":17915.05},{"$f":"IFERROR(VLOOKUP($A119,Expended!$A$2:$J$198,10,FALSE),0)","v":99056.05},{"$f":"IFERROR(VLOOKUP($A119,Expended!$A$2:$L$198,11,FALSE),0)","v":11.81},{"$f":"VLOOKUP($A119,Prior!$A$1:$K$199,5,FALSE)","v":9466},{"$f":"VLOOKUP($A119,Prior!$A$1:$K$199,6,FALSE)","v":18066},{"$f":"VLOOKUP($A119,Prior!$A$1:$K$199,7,FALSE)","v":0},{"$f":"VLOOKUP($A119,Prior!$A$1:$K$199,8,FALSE)","v":0},{"$f":"VLOOKUP($A119,Prior!$A$1:$K$199,9,FALSE)","v":0},{"$f":"VLOOKUP($A119,Prior!$A$1:$K$199,10,FALSE)","v":27297.940000000002},{"$f":"VLOOKUP($A119,Prior!$A$1:$K$199,11,FALSE)","v":32406},0,0,0,0,169834.95,3419.3799999999901,0]
[149,"NORTH GEM DISTRICT",800469277,{"$f":"IFERROR(VLOOKUP($A120,Awarded!$A$2:$J$196,4,FALSE),0)","v":12493.82},{"$f":"IFERROR(VLOOKUP($A120,Awarded!$A$2:$J$196,5,FALSE),0)","v":16813.25},{"$f":"IFERROR(VLOOKUP($A120,Awarded!$A$2:$J$196,6,FALSE),0)","v":39465.22},{"$f":"IFERROR(VLOOKUP($A120,Awarded!$A$2:$J$196,7,FALSE),0)","v":59728.07},{"$f":"IFERROR(VLOOKUP($A120,Awarded!$A$2:$J$196,8,FALSE),0)","v":215771},{"$f":"IFERROR(VLOOKUP($A120,Awarded!$A$2:$J$196,9,FALSE),0)","v":107242.26},{"$f":"IFERROR(VLOOKUP($A120,Awarded!$A$2:$J$196,10,FALSE),0)","v":26789.759999999998},{"$f":"IFERROR(VLOOKUP($A120,Expended!$A$2:$J$198,5,FALSE),0)","v":11738.74},{"$f":"IFERROR(VLOOKUP($A120,Expended!$A$2:$J$198,6,FALSE),0)","v":17.25},{"$f":"IFERROR(VLOOKUP($A120,Expended!$A$2:$J$198,7,FALSE),0)","v":13575.77},{"$f":"IFERROR(VLOOKUP($A120,Expended!$A$2:$J$198,8,FALSE),0)","v":28700.07},{"$f":"IFERROR(VLOOKUP($A120,Expended!$A$2:$J$198,9,FALSE),0)","v":0},{"$f":"IFERROR(VLOOKUP($A120,Expended!$A$2:$J$198,10,FALSE),0)","v":33902.31},{"$f":"IFERROR(VLOOKUP($A120,Expended!$A$2:$L$198,11,FALSE),0)","v":11377.36},{"$f":"VLOOKUP($A120,Prior!$A$1:$K$199,5,FALSE)","v":755.08},{"$f":"VLOOKUP($A120,Prior!$A$1:$K$199,6,FALSE)","v":16796},{"$f":"VLOOKUP($A120,Prior!$A$1:$K$199,7,FALSE)","v":0},{"$f":"VLOOKUP($A120,Prior!$A$1:$K$199,8,FALSE)","v":31028},{"$f":"VLOOKUP($A120,Prior!$A$1:$K$199,9,FALSE)","v":0},{"$f":"VLOOKUP($A120,Prior!$A$1:$K$199,10,FALSE)","v":0},{"$f":"VLOOKUP($A120,Prior!$A$1:$K$199,11,FALSE)","v":0},0,0,25889.45,0,215771,73339.95,15412.399999999998]
[480,"NORTH IDAHO STEM CHARTER ACADEMY, INC.",14744681,{"$f":"IFERROR(VLOOKUP($A121,Awarded!$A$2:$J$196,4,FALSE),0)","v":15543},{"$f":"IFERROR(VLOOKUP($A121,Awarded!$A$2:$J$196,5,FALSE),0)","v":0},{"$f":"IFERROR(VLOOKUP($A121,Awarded!$A$2:$J$196,6,FALSE),0)","v":214656.55},{"$f":"IFERROR(VLOOKUP($A121,Awarded!$A$2:$J$196,7,FALSE),0)","v":0},{"$f":"IFERROR(VLOOKUP($A121,Awarded!$A$2:$J$196,8,FALSE),0)","v":349143},{"$f":"IFERROR(VLOOKUP($A121,Awarded!$A$2:$J$196,9,FALSE),0)","v":0},{"$f":"IFERROR(VLOOKUP($A121,Awarded!$A$2:$J$196,10,FALSE),0)","v":0},{"$f":"IFERROR(VLOOKUP($A121,Expended!$A$2:$J$198,5,FALSE),0)","v":1440},{"$f":"IFERROR(VLOOKUP($A121,Expended!$A$2:$J$198,6,FALSE),0)","v":0},{"$f":"IFERROR(VLOOKUP($A121,Expended!$A$2:$J$198,7,FALSE),0)","v":4390.55},{"$f":"IFERROR(VLOOKUP($A121,Expended!$A$2:$J$198,8,FALSE),0)","v":0},{"$f":"IFERROR(VLOOKUP($A121,Expended!$A$2:$J$198,9,FALSE),0)","v":191587.58000000002},{"$f":"IFERROR(VLOOKUP($A121,Expended!$A$2:$J$198,10,FALSE),0)","v":0},{"$f":"IFERROR(VLOOKUP($A121,Expended!$A$2:$L$198,11,FALSE),0)","v":0},{"$f":"VLOOKUP($A121,Prior!$A$1:$K$199,5,FALSE)","v":14103},{"$f":"VLOOKUP($A121,Prior!$A$1:$K$199,6,FALSE)","v":0},{"$f":"VLOOKUP($A121,Prior!$A$1:$K$199,7,FALSE)","v":210266},{"$f":"VLOOKUP($A121,Prior!$A$1:$K$199,8,FALSE)","v":0},{"$f":"VLOOKUP($A121,Prior!$A$1:$K$199,9,FALSE)","v":0},{"$f":"VLOOKUP($A121,Prior!$A$1:$K$199,10,FALSE)","v":0},{"$f":"VLOOKUP($A121,Prior!$A$1:$K$199,11,FALSE)","v":0},0,0,0,0,157555.41999999998,0,0]
[493,"NORTH STAR CHARTER SCHOOL, INC.",114313609,{"$f":"IFERROR(VLOOKUP($A122,Awarded!$A$2:$J$196,4,FALSE),0)","v":19249.489999999998},{"$f":"IFERROR(VLOOKUP($A122,Awarded!$A$2:$J$196,5,FALSE),0)","v":0},{"$f":"IFERROR(VLOOKUP($A122,Awarded!$A$2:$J$196,6,FALSE),0)","v":314522.19},{"$f":"IFERROR(VLOOKUP($A122,Awarded!$A$2:$J$196,7,FALSE),0)","v":0},{"$f":"IFERROR(VLOOKUP($A122,Awarded!$A$2:$J$196,8,FALSE),0)","v":349143},{"$f":"IFERROR(VLOOKUP($A122,Awarded!$A$2:$J$196,9,FALSE),0)","v":0},{"$f":"IFERROR(VLOOKUP($A122,Awarded!$A$2:$J$196,10,FALSE),0)","v":0},{"$f":"IFERROR(VLOOKUP($A122,Expended!$A$2:$J$198,5,FALSE),0)","v":852.49},{"$f":"IFERROR(VLOOKUP($A122,Expended!$A$2:$J$198,6,FALSE),0)","v":0},{"$f":"IFERROR(VLOOKUP($A122,Expended!$A$2:$J$198,7,FALSE),0)","v":6433.19},{"$f":"IFERROR(VLOOKUP($A122,Expended!$A$2:$J$198,8,FALSE),0)","v":0},{"$f":"IFERROR(VLOOKUP($A122,Expended!$A$2:$J$198,9,FALSE),0)","v":284792.93},{"$f":"IFERROR(VLOOKUP($A122,Expended!$A$2:$J$198,10,FALSE),0)","v":0},{"$f":"IFERROR(VLOOKUP($A122,Expended!$A$2:$L$198,11,FALSE),0)","v":0},{"$f":"VLOOKUP($A122,Prior!$A$1:$K$199,5,FALSE)","v":18397},{"$f":"VLOOKUP($A122,Prior!$A$1:$K$199,6,FALSE)","v":0},{"$f":"VLOOKUP($A122,Prior!$A$1:$K$199,7,FALSE)","v":308089},{"$f":"VLOOKUP($A122,Prior!$A$1:$K$199,8,FALSE)","v":0},{"$f":"VLOOKUP($A122,Prior!$A$1:$K$199,9,FALSE)","v":64350.07},{"$f":"VLOOKUP($A122,Prior!$A$1:$K$199,10,FALSE)","v":0},{"$f":"VLOOKUP($A122,Prior!$A$1:$K$199,11,FALSE)","v":0},0,0,0,0,0,0,0]
[465,"NORTH VALLEY ACADEMY, INC.",830799883,{"$f":"IFERROR(VLOOKUP($A123,Awarded!$A$2:$J$196,4,FALSE),0)","v":10743.189999999999},{"$f":"IFERROR(VLOOKUP($A123,Awarded!$A$2:$J$196,5,FALSE),0)","v":39577.599999999999},{"$f":"IFERROR(VLOOKUP($A123,Awarded!$A$2:$J$196,6,FALSE),0)","v":0},{"$f":"IFERROR(VLOOKUP($A123,Awarded!$A$2:$J$196,7,FALSE),0)","v":158169.03},{"$f":"IFERROR(VLOOKUP($A123,Awarded!$A$2:$J$196,8,FALSE),0)","v":0},{"$f":"IFERROR(VLOOKUP($A123,Awarded!$A$2:$J$196,9,FALSE),0)","v":283994.06},{"$f":"IFERROR(VLOOKUP($A123,Awarded!$A$2:$J$196,10,FALSE),0)","v":70941.850000000006},{"$f":"IFERROR(VLOOKUP($A123,Expended!$A$2:$J$198,5,FALSE),0)","v":1150},{"$f":"IFERROR(VLOOKUP($A123,Expended!$A$2:$J$198,6,FALSE),0)","v":0},{"$f":"IFERROR(VLOOKUP($A123,Expended!$A$2:$J$198,7,FALSE),0)","v":0},{"$f":"IFERROR(VLOOKUP($A123,Expended!$A$2:$J$198,8,FALSE),0)","v":39357.910000000003},{"$f":"IFERROR(VLOOKUP($A123,Expended!$A$2:$J$198,9,FALSE),0)","v":0},{"$f":"IFERROR(VLOOKUP($A123,Expended!$A$2:$J$198,10,FALSE),0)","v":104137.43},{"$f":"IFERROR(VLOOKUP($A123,Expended!$A$2:$L$198,11,FALSE),0)","v":0},{"$f":"VLOOKUP($A123,Prior!$A$1:$K$199,5,FALSE)","v":9163.9500000000007},{"$f":"VLOOKUP($A123,Prior!$A$1:$K$199,6,FALSE)","v":39537},{"$f":"VLOOKUP($A123,Prior!$A$1:$K$199,7,FALSE)","v":0},{"$f":"VLOOKUP($A123,Prior!$A$1:$K$199,8,FALSE)","v":98297.459999999992},{"$f":"VLOOKUP($A123,Prior!$A$1:$K$199,9,FALSE)","v":0},{"$f":"VLOOKUP($A123,Prior!$A$1:$K$199,10,FALSE)","v":160000},{"$f":"VLOOKUP($A123,Prior!$A$1:$K$199,11,FALSE)","v":0},429.23999999999796,40.599999999998545,0,20513.660000000003,0,19856.630000000005,70941.850000000006]
[135,"NOTUS DISTRICT",100015239,{"$f":"IFERROR(VLOOKUP($A124,Awarded!$A$2:$J$196,4,FALSE),0)","v":12811.35},{"$f":"IFERROR(VLOOKUP($A124,Awarded!$A$2:$J$196,5,FALSE),0)","v":74132.05},{"$f":"IFERROR(VLOOKUP($A124,Awarded!$A$2:$J$196,6,FALSE),0)","v":0},{"$f":"IFERROR(VLOOKUP($A124,Awarded!$A$2:$J$196,7,FALSE),0)","v":257441.86},{"$f":"IFERROR(VLOOKUP($A124,Awarded!$A$2:$J$196,8,FALSE),0)","v":0},{"$f":"IFERROR(VLOOKUP($A124,Awarded!$A$2:$J$196,9,FALSE),0)","v":462238.59},{"$f":"IFERROR(VLOOKUP($A124,Awarded!$A$2:$J$196,10,FALSE),0)","v":115468.07},{"$f":"IFERROR(VLOOKUP($A124,Expended!$A$2:$J$198,5,FALSE),0)","v":8356.49},{"$f":"IFERROR(VLOOKUP($A124,Expended!$A$2:$J$198,6,FALSE),0)","v":0},{"$f":"IFERROR(VLOOKUP($A124,Expended!$A$2:$J$198,7,FALSE),0)","v":0},{"$f":"IFERROR(VLOOKUP($A124,Expended!$A$2:$J$198,8,FALSE),0)","v":233134.95},{"$f":"IFERROR(VLOOKUP($A124,Expended!$A$2:$J$198,9,FALSE),0)","v":0},{"$f":"IFERROR(VLOOKUP($A124,Expended!$A$2:$J$198,10,FALSE),0)","v":196639.27},{"$f":"IFERROR(VLOOKUP($A124,Expended!$A$2:$L$198,11,FALSE),0)","v":115468.07},{"$f":"VLOOKUP($A124,Prior!$A$1:$K$199,5,FALSE)","v":0},{"$f":"VLOOKUP($A124,Prior!$A$1:$K$199,6,FALSE)","v":74056},{"$f":"VLOOKUP($A124,Prior!$A$1:$K$199,7,FALSE)","v":0},{"$f":"VLOOKUP($A124,Prior!$A$1:$K$199,8,FALSE)","v":24306.91},{"$f":"VLOOKUP($A124,Prior!$A$1:$K$199,9,FALSE)","v":0},{"$f":"VLOOKUP($A124,Prior!$A$1:$K$199,10,FALSE)","v":0},{"$f":"VLOOKUP($A124,Prior!$A$1:$K$199,11,FALSE)","v":0},4454.8600000000006,76.05000000000291,0,0,0,265599.32000000007,0]
[351,"ONEIDA COUNTY DISTRICT",100015247,{"$f":"IFERROR(VLOOKUP($A125,Awarded!$A$2:$J$196,4,FALSE),0)","v":45103},{"$f":"IFERROR(VLOOKUP($A125,Awarded!$A$2:$J$196,5,FALSE),0)","v":111597.48},{"$f":"IFERROR(VLOOKUP($A125,Awarded!$A$2:$J$196,6,FALSE),0)","v":1875436.92},{"$f":"IFERROR(VLOOKUP($A125,Awarded!$A$2:$J$196,7,FALSE),0)","v":445992.09},{"$f":"IFERROR(VLOOKUP($A125,Awarded!$A$2:$J$196,8,FALSE),0)","v":0},{"$f":"IFERROR(VLOOKUP($A125,Awarded!$A$2:$J$196,9,FALSE),0)","v":800782.85},{"$f":"IFERROR(VLOOKUP($A125,Awarded!$A$2:$J$196,10,FALSE),0)","v":200036.88},{"$f":"IFERROR(VLOOKUP($A125,Expended!$A$2:$J$198,5,FALSE),0)","v":1306},{"$f":"IFERROR(VLOOKUP($A125,Expended!$A$2:$J$198,6,FALSE),0)","v":114.48},{"$f":"IFERROR(VLOOKUP($A125,Expended!$A$2:$J$198,7,FALSE),0)","v":38357},{"$f":"IFERROR(VLOOKUP($A125,Expended!$A$2:$J$198,8,FALSE),0)","v":300562.26000000007},{"$f":"IFERROR(VLOOKUP($A125,Expended!$A$2:$J$198,9,FALSE),0)","v":0},{"$f":"IFERROR(VLOOKUP($A125,Expended!$A$2:$J$198,10,FALSE),0)","v":104823.42},{"$f":"IFERROR(VLOOKUP($A125,Expended!$A$2:$L$198,11,FALSE),0)","v":0},{"$f":"VLOOKUP($A125,Prior!$A$1:$K$199,5,FALSE)","v":43797},{"$f":"VLOOKUP($A125,Prior!$A$1:$K$199,6,FALSE)","v":111483},{"$f":"VLOOKUP($A125,Prior!$A$1:$K$199,7,FALSE)","v":1837077},{"$f":"VLOOKUP($A125,Prior!$A$1:$K$199,8,FALSE)","v":0},{"$f":"VLOOKUP($A125,Prior!$A$1:$K$199,9,FALSE)","v":0},{"$f":"VLOOKUP($A125,Prior!$A$1:$K$199,10,FALSE)","v":0},{"$f":"VLOOKUP($A125,Prior!$A$1:$K$199,11,FALSE)","v":158706.6},0,0,2.9199999999254942,145429.82999999996,0,695959.42999999993,41330.28]
[171,"OROFINO JOINT DISTRICT",97241129,{"$f":"IFERROR(VLOOKUP($A126,Awarded!$A$2:$J$196,4,FALSE),0)","v":23275.19},{"$f":"IFERROR(VLOOKUP($A126,Awarded!$A$2:$J$196,5,FALSE),0)","v":170795.21},{"$f":"IFERROR(VLOOKUP($A126,Awarded!$A$2:$J$196,6,FALSE),0)","v":0},{"$f":"IFERROR(VLOOKUP($A126,Awarded!$A$2:$J$196,7,FALSE),0)","v":836082.7},{"$f":"IFERROR(VLOOKUP($A126,Awarded!$A$2:$J$196,8,FALSE),0)","v":0},{"$f":"IFERROR(VLOOKUP($A126,Awarded!$A$2:$J$196,9,FALSE),0)","v":1501192.4},{"$f":"IFERROR(VLOOKUP($A126,Awarded!$A$2:$J$196,10,FALSE),0)","v":374999.63},{"$f":"IFERROR(VLOOKUP($A126,Expended!$A$2:$J$198,5,FALSE),0)","v":2678.19},{"$f":"IFERROR(VLOOKUP($A126,Expended!$A$2:$J$198,6,FALSE),0)","v":175.21},{"$f":"IFERROR(VLOOKUP($A126,Expended!$A$2:$J$198,7,FALSE),0)","v":0},{"$f":"IFERROR(VLOOKUP($A126,Expended!$A$2:$J$198,8,FALSE),0)","v":341756.37},{"$f":"IFERROR(VLOOKUP($A126,Expended!$A$2:$J$198,9,FALSE),0)","v":0},{"$f":"IFERROR(VLOOKUP($A126,Expended!$A$2:$J$198,10,FALSE),0)","v":1207691.96},{"$f":"IFERROR(VLOOKUP($A126,Expended!$A$2:$L$198,11,FALSE),0)","v":73473.850000000006},{"$f":"VLOOKUP($A126,Prior!$A$1:$K$199,5,FALSE)","v":20597},{"$f":"VLOOKUP($A126,Prior!$A$1:$K$199,6,FALSE)","v":170620},{"$f":"VLOOKUP($A126,Prior!$A$1:$K$199,7,FALSE)","v":0},{"$f":"VLOOKUP($A126,Prior!$A$1:$K$199,8,FALSE)","v":421545.53},{"$f":"VLOOKUP($A126,Prior!$A$1:$K$199,9,FALSE)","v":0},{"$f":"VLOOKUP($A126,Prior!$A$1:$K$199,10,FALSE)","v":51910.510000000009},{"$f":"VLOOKUP($A126,Prior!$A$1:$K$199,11,FALSE)","v":39587.090000000004},0,0,0,72780.79999999993,0,241589.92999999993,261938.69000000003]
[472,"PALOUSE PRAIRIE EDUCATIONAL ORGANIZATION, INC.",609526947,{"$f":"IFERROR(VLOOKUP($A127,Awarded!$A$2:$J$196,4,FALSE),0)","v":10049},{"$f":"IFERROR(VLOOKUP($A127,Awarded!$A$2:$J$196,5,FALSE),0)","v":15434.83},{"$f":"IFERROR(VLOOKUP($A127,Awarded!$A$2:$J$196,6,FALSE),0)","v":26183.55},{"$f":"IFERROR(VLOOKUP($A127,Awarded!$A$2:$J$196,7,FALSE),0)","v":60535.88},{"$f":"IFERROR(VLOOKUP($A127,Awarded!$A$2:$J$196,8,FALSE),0)","v":213967},{"$f":"IFERROR(VLOOKUP($A127,Awarded!$A$2:$J$196,9,FALSE),0)","v":108692.94},{"$f":"IFERROR(VLOOKUP($A127,Awarded!$A$2:$J$196,10,FALSE),0)","v":27151.89},{"$f":"IFERROR(VLOOKUP($A127,Expended!$A$2:$J$198,5,FALSE),0)","v":444.25},{"$f":"IFERROR(VLOOKUP($A127,Expended!$A$2:$J$198,6,FALSE),0)","v":15.83},{"$f":"IFERROR(VLOOKUP($A127,Expended!$A$2:$J$198,7,FALSE),0)","v":6478.12},{"$f":"IFERROR(VLOOKUP($A127,Expended!$A$2:$J$198,8,FALSE),0)","v":20481.95},{"$f":"IFERROR(VLOOKUP($A127,Expended!$A$2:$J$198,9,FALSE),0)","v":0},{"$f":"IFERROR(VLOOKUP($A127,Expended!$A$2:$J$198,10,FALSE),0)","v":65211.11},{"$f":"IFERROR(VLOOKUP($A127,Expended!$A$2:$L$198,11,FALSE),0)","v":11801.34},{"$f":"VLOOKUP($A127,Prior!$A$1:$K$199,5,FALSE)","v":9604.75},{"$f":"VLOOKUP($A127,Prior!$A$1:$K$199,6,FALSE)","v":15419},{"$f":"VLOOKUP($A127,Prior!$A$1:$K$199,7,FALSE)","v":19705.43},{"$f":"VLOOKUP($A127,Prior!$A$1:$K$199,8,FALSE)","v":40053.93},{"$f":"VLOOKUP($A127,Prior!$A$1:$K$199,9,FALSE)","v":0},{"$f":"VLOOKUP($A127,Prior!$A$1:$K$199,10,FALSE)","v":16638.48},{"$f":"VLOOKUP($A127,Prior!$A$1:$K$199,11,FALSE)","v":13334.240000000002},0,0,0,0,213967,26843.350000000002,2016.3099999999977]
[137,"PARMA DISTRICT",100015254,{"$f":"IFERROR(VLOOKUP($A128,Awarded!$A$2:$J$196,4,FALSE),0)","v":19810.66},{"$f":"IFERROR(VLOOKUP($A128,Awarded!$A$2:$J$196,5,FALSE),0)","v":154946.95000000001},{"$f":"IFERROR(VLOOKUP($A128,Awarded!$A$2:$J$196,6,FALSE),0)","v":0},{"$f":"IFERROR(VLOOKUP($A128,Awarded!$A$2:$J$196,7,FALSE),0)","v":619238.96},{"$f":"IFERROR(VLOOKUP($A128,Awarded!$A$2:$J$196,8,FALSE),0)","v":0},{"$f":"IFERROR(VLOOKUP($A128,Awarded!$A$2:$J$196,9,FALSE),0)","v":1111849.28},{"$f":"IFERROR(VLOOKUP($A128,Awarded!$A$2:$J$196,10,FALSE),0)","v":277741.2},{"$f":"IFERROR(VLOOKUP($A128,Expended!$A$2:$J$198,5,FALSE),0)","v":708.66},{"$f":"IFERROR(VLOOKUP($A128,Expended!$A$2:$J$198,6,FALSE),0)","v":158.94999999999999},{"$f":"IFERROR(VLOOKUP($A128,Expended!$A$2:$J$198,7,FALSE),0)","v":0},{"$f":"IFERROR(VLOOKUP($A128,Expended!$A$2:$J$198,8,FALSE),0)","v":129830.66},{"$f":"IFERROR(VLOOKUP($A128,Expended!$A$2:$J$198,9,FALSE),0)","v":0},{"$f":"IFERROR(VLOOKUP($A128,Expended!$A$2:$J$198,10,FALSE),0)","v":498355.29999999993},{"$f":"IFERROR(VLOOKUP($A128,Expended!$A$2:$L$198,11,FALSE),0)","v":92616.24},{"$f":"VLOOKUP($A128,Prior!$A$1:$K$199,5,FALSE)","v":19102},{"$f":"VLOOKUP($A128,Prior!$A$1:$K$199,6,FALSE)","v":154788},{"$f":"VLOOKUP($A128,Prior!$A$1:$K$199,7,FALSE)","v":0},{"$f":"VLOOKUP($A128,Prior!$A$1:$K$199,8,FALSE)","v":432539.07},{"$f":"VLOOKUP($A128,Prior!$A$1:$K$199,9,FALSE)","v":0},{"$f":"VLOOKUP($A128,Prior!$A$1:$K$199,10,FALSE)","v":0},{"$f":"VLOOKUP($A128,Prior!$A$1:$K$199,11,FALSE)","v":0},0,0,0,56869.229999999923,0,613493.9800000001,185124.96000000002]
[497,"PATHWAYS IN EDUCATION - NAMPA, INC.",80600403,{"$f":"IFERROR(VLOOKUP($A129,Awarded!$A$2:$J$196,4,FALSE),0)","v":11054.51},{"$f":"IFERROR(VLOOKUP($A129,Awarded!$A$2:$J$196,5,FALSE),0)","v":0},{"$f":"IFERROR(VLOOKUP($A129,Awarded!$A$2:$J$196,6,FALSE),0)","v":26541.88},{"$f":"IFERROR(VLOOKUP($A129,Awarded!$A$2:$J$196,7,FALSE),0)","v":125226.09},{"$f":"IFERROR(VLOOKUP($A129,Awarded!$A$2:$J$196,8,FALSE),0)","v":69514},{"$f":"IFERROR(VLOOKUP($A129,Awarded!$A$2:$J$196,9,FALSE),0)","v":224845.52},{"$f":"IFERROR(VLOOKUP($A129,Awarded!$A$2:$J$196,10,FALSE),0)","v":56166.46},{"$f":"IFERROR(VLOOKUP($A129,Expended!$A$2:$J$198,5,FALSE),0)","v":410.55},{"$f":"IFERROR(VLOOKUP($A129,Expended!$A$2:$J$198,6,FALSE),0)","v":0},{"$f":"IFERROR(VLOOKUP($A129,Expended!$A$2:$J$198,7,FALSE),0)","v":8217.41},{"$f":"IFERROR(VLOOKUP($A129,Expended!$A$2:$J$198,8,FALSE),0)","v":109290},{"$f":"IFERROR(VLOOKUP($A129,Expended!$A$2:$J$198,9,FALSE),0)","v":16407.490000000002},{"$f":"IFERROR(VLOOKUP($A129,Expended!$A$2:$J$198,10,FALSE),0)","v":0},{"$f":"IFERROR(VLOOKUP($A129,Expended!$A$2:$L$198,11,FALSE),0)","v":9060},{"$f":"VLOOKUP($A129,Prior!$A$1:$K$199,5,FALSE)","v":10608.439999999999},{"$f":"VLOOKUP($A129,Prior!$A$1:$K$199,6,FALSE)","v":0},{"$f":"VLOOKUP($A129,Prior!$A$1:$K$199,7,FALSE)","v":14194},{"$f":"VLOOKUP($A129,Prior!$A$1:$K$199,8,FALSE)","v":12480},{"$f":"VLOOKUP($A129,Prior!$A$1:$K$199,9,FALSE)","v":0},{"$f":"VLOOKUP($A129,Prior!$A$1:$K$199,10,FALSE)","v":49930},{"$f":"VLOOKUP($A129,Prior!$A$1:$K$199,11,FALSE)","v":1426},35.520000000002256,0,4130.4700000000012,3456.0899999999965,53106.509999999995,174915.52,45680.46]
[371,"PAYETTE JOINT DISTRICT",181918483,{"$f":"IFERROR(VLOOKUP($A130,Awarded!$A$2:$J$196,4,FALSE),0)","v":23894.84},{"$f":"IFERROR(VLOOKUP($A130,Awarded!$A$2:$J$196,5,FALSE),0)","v":360135.45},{"$f":"IFERROR(VLOOKUP($A130,Awarded!$A$2:$J$196,6,FALSE),0)","v":0},{"$f":"IFERROR(VLOOKUP($A130,Awarded!$A$2:$J$196,7,FALSE),0)","v":1439265.62},{"$f":"IFERROR(VLOOKUP($A130,Awarded!$A$2:$J$196,8,FALSE),0)","v":0},{"$f":"IFERROR(VLOOKUP($A130,Awarded!$A$2:$J$196,9,FALSE),0)","v":2584213.2799999998},{"$f":"IFERROR(VLOOKUP($A130,Awarded!$A$2:$J$196,10,FALSE),0)","v":645540.21},{"$f":"IFERROR(VLOOKUP($A130,Expended!$A$2:$J$198,5,FALSE),0)","v":5891.8399999999992},{"$f":"IFERROR(VLOOKUP($A130,Expended!$A$2:$J$198,6,FALSE),0)","v":369.45},{"$f":"IFERROR(VLOOKUP($A130,Expended!$A$2:$J$198,7,FALSE),0)","v":0},{"$f":"IFERROR(VLOOKUP($A130,Expended!$A$2:$J$198,8,FALSE),0)","v":53842.32},{"$f":"IFERROR(VLOOKUP($A130,Expended!$A$2:$J$198,9,FALSE),0)","v":0},{"$f":"IFERROR(VLOOKUP($A130,Expended!$A$2:$J$198,10,FALSE),0)","v":746389.32},{"$f":"IFERROR(VLOOKUP($A130,Expended!$A$2:$L$198,11,FALSE),0)","v":378466.89999999997},{"$f":"VLOOKUP($A130,Prior!$A$1:$K$199,5,FALSE)","v":18003},{"$f":"VLOOKUP($A130,Prior!$A$1:$K$199,6,FALSE)","v":359766},{"$f":"VLOOKUP($A130,Prior!$A$1:$K$199,7,FALSE)","v":0},{"$f":"VLOOKUP($A130,Prior!$A$1:$K$199,8,FALSE)","v":1385423.3},{"$f":"VLOOKUP($A130,Prior!$A$1:$K$199,9,FALSE)","v":0},{"$f":"VLOOKUP($A130,Prior!$A$1:$K$199,10,FALSE)","v":0},{"$f":"VLOOKUP($A130,Prior!$A$1:$K$199,11,FALSE)","v":267073.31},0,0,0,0,0,1837823.96,0]
[794,"PAYETTE RIVER TECHNICAL ACADEMY, INC.",965786168,{"$f":"IFERROR(VLOOKUP($A131,Awarded!$A$2:$J$196,4,FALSE),0)","v":7765.2},{"$f":"IFERROR(VLOOKUP($A131,Awarded!$A$2:$J$196,5,FALSE),0)","v":0},{"$f":"IFERROR(VLOOKUP($A131,Awarded!$A$2:$J$196,6,FALSE),0)","v":76788.62},{"$f":"IFERROR(VLOOKUP($A131,Awarded!$A$2:$J$196,7,FALSE),0)","v":0},{"$f":"IFERROR(VLOOKUP($A131,Awarded!$A$2:$J$196,8,FALSE),0)","v":0},{"$f":"IFERROR(VLOOKUP($A131,Awarded!$A$2:$J$196,9,FALSE),0)","v":0},{"$f":"IFERROR(VLOOKUP($A131,Awarded!$A$2:$J$196,10,FALSE),0)","v":0},{"$f":"IFERROR(VLOOKUP($A131,Expended!$A$2:$J$198,5,FALSE),0)","v":4590},{"$f":"IFERROR(VLOOKUP($A131,Expended!$A$2:$J$198,6,FALSE),0)","v":0},{"$f":"IFERROR(VLOOKUP($A131,Expended!$A$2:$J$198,7,FALSE),0)","v":0},{"$f":"IFERROR(VLOOKUP($A131,Expended!$A$2:$J$198,8,FALSE),0)","v":0},{"$f":"IFERROR(VLOOKUP($A131,Expended!$A$2:$J$198,9,FALSE),0)","v":0},{"$f":"IFERROR(VLOOKUP($A131,Expended!$A$2:$J$198,10,FALSE),0)","v":0},{"$f":"IFERROR(VLOOKUP($A131,Expended!$A$2:$L$198,11,FALSE),0)","v":0},{"$f":"VLOOKUP($A131,Prior!$A$1:$K$199,5,FALSE)","v":0},{"$f":"VLOOKUP($A131,Prior!$A$1:$K$199,6,FALSE)","v":0},{"$f":"VLOOKUP($A131,Prior!$A$1:$K$199,7,FALSE)","v":75218},{"$f":"VLOOKUP($A131,Prior!$A$1:$K$199,8,FALSE)","v":0},{"$f":"VLOOKUP($A131,Prior!$A$1:$K$199,9,FALSE)","v":0},{"$f":"VLOOKUP($A131,Prior!$A$1:$K$199,10,FALSE)","v":0},{"$f":"VLOOKUP($A131,Prior!$A$1:$K$199,11,FALSE)","v":0},{"$f":"D131-K131-R131","v":3175.2},{"$f":"E131-L131-S131","v":0},{"$f":"F131-M131-T131","v":1570.6199999999953},{"$f":"G131-N131-U131","v":0},{"$f":"H131-O131-V131","v":0},{"$f":"I131-P131-W131","v":0},{"$f":"J131-Q131-X131","v":0}]
[511,"PEACE VALLEY CHARTER SCHOOL, INC.",80965852,{"$f":"IFERROR(VLOOKUP($A132,Awarded!$A$2:$J$196,4,FALSE),0)","v":13949.18},{"$f":"IFERROR(VLOOKUP($A132,Awarded!$A$2:$J$196,5,FALSE),0)","v":14548.93},{"$f":"IFERROR(VLOOKUP($A132,Awarded!$A$2:$J$196,6,FALSE),0)","v":41796.910000000003},{"$f":"IFERROR(VLOOKUP($A132,Awarded!$A$2:$J$196,7,FALSE),0)","v":81235.34},{"$f":"IFERROR(VLOOKUP($A132,Awarded!$A$2:$J$196,8,FALSE),0)","v":167745},{"$f":"IFERROR(VLOOKUP($A132,Awarded!$A$2:$J$196,9,FALSE),0)","v":145860.01},{"$f":"IFERROR(VLOOKUP($A132,Awarded!$A$2:$J$196,10,FALSE),0)","v":36436.28},{"$f":"IFERROR(VLOOKUP($A132,Expended!$A$2:$J$198,5,FALSE),0)","v":2795.18},{"$f":"IFERROR(VLOOKUP($A132,Expended!$A$2:$J$198,6,FALSE),0)","v":14.93},{"$f":"IFERROR(VLOOKUP($A132,Expended!$A$2:$J$198,7,FALSE),0)","v":41796.910000000003},{"$f":"IFERROR(VLOOKUP($A132,Expended!$A$2:$J$198,8,FALSE),0)","v":61267.32},{"$f":"IFERROR(VLOOKUP($A132,Expended!$A$2:$J$198,9,FALSE),0)","v":72023},{"$f":"IFERROR(VLOOKUP($A132,Expended!$A$2:$J$198,10,FALSE),0)","v":50346.759999999995},{"$f":"IFERROR(VLOOKUP($A132,Expended!$A$2:$L$198,11,FALSE),0)","v":36436.28},{"$f":"VLOOKUP($A132,Prior!$A$1:$K$199,5,FALSE)","v":11154},{"$f":"VLOOKUP($A132,Prior!$A$1:$K$199,6,FALSE)","v":14534},{"$f":"VLOOKUP($A132,Prior!$A$1:$K$199,7,FALSE)","v":0},{"$f":"VLOOKUP($A132,Prior!$A$1:$K$199,8,FALSE)","v":19968.020000000004},{"$f":"VLOOKUP($A132,Prior!$A$1:$K$199,9,FALSE)","v":0},{"$f":"VLOOKUP($A132,Prior!$A$1:$K$199,10,FALSE)","v":95513.25},{"$f":"VLOOKUP($A132,Prior!$A$1:$K$199,11,FALSE)","v":0},0,0,0,0,95722,0,0]
[553,"PINECREST ACADEMY OF IDAHO, INC.",117180145,{"$f":"IFERROR(VLOOKUP($A133,Awarded!$A$2:$J$196,4,FALSE),0)","v":10225.33},{"$f":"IFERROR(VLOOKUP($A133,Awarded!$A$2:$J$196,5,FALSE),0)","v":0},{"$f":"IFERROR(VLOOKUP($A133,Awarded!$A$2:$J$196,6,FALSE),0)","v":41082.29},{"$f":"IFERROR(VLOOKUP($A133,Awarded!$A$2:$J$196,7,FALSE),0)","v":0},{"$f":"IFERROR(VLOOKUP($A133,Awarded!$A$2:$J$196,8,FALSE),0)","v":349143},{"$f":"IFERROR(VLOOKUP($A133,Awarded!$A$2:$J$196,9,FALSE),0)","v":0},{"$f":"IFERROR(VLOOKUP($A133,Awarded!$A$2:$J$196,10,FALSE),0)","v":0},{"$f":"IFERROR(VLOOKUP($A133,Expended!$A$2:$J$198,5,FALSE),0)","v":2451.06},{"$f":"IFERROR(VLOOKUP($A133,Expended!$A$2:$J$198,6,FALSE),0)","v":0},{"$f":"IFERROR(VLOOKUP($A133,Expended!$A$2:$J$198,7,FALSE),0)","v":0},{"$f":"IFERROR(VLOOKUP($A133,Expended!$A$2:$J$198,8,FALSE),0)","v":0},{"$f":"IFERROR(VLOOKUP($A133,Expended!$A$2:$J$198,9,FALSE),0)","v":144285.83000000002},{"$f":"IFERROR(VLOOKUP($A133,Expended!$A$2:$J$198,10,FALSE),0)","v":0},{"$f":"IFERROR(VLOOKUP($A133,Expended!$A$2:$L$198,11,FALSE),0)","v":0},{"$f":"VLOOKUP($A133,Prior!$A$1:$K$199,5,FALSE)","v":0},{"$f":"VLOOKUP($A133,Prior!$A$1:$K$199,6,FALSE)","v":0},{"$f":"VLOOKUP($A133,Prior!$A$1:$K$199,7,FALSE)","v":35067.449999999997},{"$f":"VLOOKUP($A133,Prior!$A$1:$K$199,8,FALSE)","v":0},{"$f":"VLOOKUP($A133,Prior!$A$1:$K$199,9,FALSE)","v":66886.959999999992},{"$f":"VLOOKUP($A133,Prior!$A$1:$K$199,10,FALSE)","v":0},{"$f":"VLOOKUP($A133,Prior!$A$1:$K$199,11,FALSE)","v":0},7774.27,0,6014.8400000000038,0,137970.21,0,0]
[364,"PLEASANT VALLEY ELEMENTARY DISTRICT",179267117,{"$f":"IFERROR(VLOOKUP($A134,Awarded!$A$2:$J$196,4,FALSE),0)","v":8082.48},{"$f":"IFERROR(VLOOKUP($A134,Awarded!$A$2:$J$196,5,FALSE),0)","v":0},{"$f":"IFERROR(VLOOKUP($A134,Awarded!$A$2:$J$196,6,FALSE),0)","v":6402.97},{"$f":"IFERROR(VLOOKUP($A134,Awarded!$A$2:$J$196,7,FALSE),0)","v":0},{"$f":"IFERROR(VLOOKUP($A134,Awarded!$A$2:$J$196,8,FALSE),0)","v":349143},{"$f":"IFERROR(VLOOKUP($A134,Awarded!$A$2:$J$196,9,FALSE),0)","v":0},{"$f":"IFERROR(VLOOKUP($A134,Awarded!$A$2:$J$196,10,FALSE),0)","v":0},{"$f":"IFERROR(VLOOKUP($A134,Expended!$A$2:$J$198,5,FALSE),0)","v":0},{"$f":"IFERROR(VLOOKUP($A134,Expended!$A$2:$J$198,6,FALSE),0)","v":0},{"$f":"IFERROR(VLOOKUP($A134,Expended!$A$2:$J$198,7,FALSE),0)","v":6402.97},{"$f":"IFERROR(VLOOKUP($A134,Expended!$A$2:$J$198,8,FALSE),0)","v":0},{"$f":"IFERROR(VLOOKUP($A134,Expended!$A$2:$J$198,9,FALSE),0)","v":94756.4},{"$f":"IFERROR(VLOOKUP($A134,Expended!$A$2:$J$198,10,FALSE),0)","v":0},{"$f":"IFERROR(VLOOKUP($A134,Expended!$A$2:$L$198,11,FALSE),0)","v":0},{"$f":"VLOOKUP($A134,Prior!$A$1:$K$199,5,FALSE)","v":2044},{"$f":"VLOOKUP($A134,Prior!$A$1:$K$199,6,FALSE)","v":0},{"$f":"VLOOKUP($A134,Prior!$A$1:$K$199,7,FALSE)","v":0},{"$f":"VLOOKUP($A134,Prior!$A$1:$K$199,8,FALSE)","v":0},{"$f":"VLOOKUP($A134,Prior!$A$1:$K$199,9,FALSE)","v":0},{"$f":"VLOOKUP($A134,Prior!$A$1:$K$199,10,FALSE)","v":0},{"$f":"VLOOKUP($A134,Prior!$A$1:$K$199,11,FALSE)","v":0},6038.48,0,0,0,254386.6,0,0]
[44,"PLUMMER-WORLEY JOINT DISTRICT",621456672,{"$f":"IFERROR(VLOOKUP($A135,Awarded!$A$2:$J$196,4,FALSE),0)","v":12294.730000000001},{"$f":"IFERROR(VLOOKUP($A135,Awarded!$A$2:$J$196,5,FALSE),0)","v":234952.03},{"$f":"IFERROR(VLOOKUP($A135,Awarded!$A$2:$J$196,6,FALSE),0)","v":0},{"$f":"IFERROR(VLOOKUP($A135,Awarded!$A$2:$J$196,7,FALSE),0)","v":938977.66},{"$f":"IFERROR(VLOOKUP($A135,Awarded!$A$2:$J$196,8,FALSE),0)","v":0},{"$f":"IFERROR(VLOOKUP($A135,Awarded!$A$2:$J$196,9,FALSE),0)","v":1685940.47},{"$f":"IFERROR(VLOOKUP($A135,Awarded!$A$2:$J$196,10,FALSE),0)","v":421150.45},{"$f":"IFERROR(VLOOKUP($A135,Expended!$A$2:$J$198,5,FALSE),0)","v":3675.03},{"$f":"IFERROR(VLOOKUP($A135,Expended!$A$2:$J$198,6,FALSE),0)","v":241.03},{"$f":"IFERROR(VLOOKUP($A135,Expended!$A$2:$J$198,7,FALSE),0)","v":0},{"$f":"IFERROR(VLOOKUP($A135,Expended!$A$2:$J$198,8,FALSE),0)","v":752267.29999999993},{"$f":"IFERROR(VLOOKUP($A135,Expended!$A$2:$J$198,9,FALSE),0)","v":0},{"$f":"IFERROR(VLOOKUP($A135,Expended!$A$2:$J$198,10,FALSE),0)","v":148213.38},{"$f":"IFERROR(VLOOKUP($A135,Expended!$A$2:$L$198,11,FALSE),0)","v":98164.25},{"$f":"VLOOKUP($A135,Prior!$A$1:$K$199,5,FALSE)","v":8567},{"$f":"VLOOKUP($A135,Prior!$A$1:$K$199,6,FALSE)","v":234711},{"$f":"VLOOKUP($A135,Prior!$A$1:$K$199,7,FALSE)","v":0},{"$f":"VLOOKUP($A135,Prior!$A$1:$K$199,8,FALSE)","v":186710.36},{"$f":"VLOOKUP($A135,Prior!$A$1:$K$199,9,FALSE)","v":0},{"$f":"VLOOKUP($A135,Prior!$A$1:$K$199,10,FALSE)","v":0},{"$f":"VLOOKUP($A135,Prior!$A$1:$K$199,11,FALSE)","v":26316.46},52.700000000000728,0,0,0,0,1537727.0899999999,296669.74]
[25,"POCATELLO DISTRICT",29614922,{"$f":"IFERROR(VLOOKUP($A136,Awarded!$A$2:$J$196,4,FALSE),0)","v":151276.85999999999},{"$f":"IFERROR(VLOOKUP($A136,Awarded!$A$2:$J$196,5,FALSE),0)","v":2135351.5699999998},{"$f":"IFERROR(VLOOKUP($A136,Awarded!$A$2:$J$196,6,FALSE),0)","v":0},{"$f":"IFERROR(VLOOKUP($A136,Awarded!$A$2:$J$196,7,FALSE),0)","v":8533847.3399999999},{"$f":"IFERROR(VLOOKUP($A136,Awarded!$A$2:$J$196,8,FALSE),0)","v":0},{"$f":"IFERROR(VLOOKUP($A136,Awarded!$A$2:$J$196,9,FALSE),0)","v":15322588},{"$f":"IFERROR(VLOOKUP($A136,Awarded!$A$2:$J$196,10,FALSE),0)","v":3827603.61},{"$f":"IFERROR(VLOOKUP($A136,Expended!$A$2:$J$198,5,FALSE),0)","v":20863.16},{"$f":"IFERROR(VLOOKUP($A136,Expended!$A$2:$J$198,6,FALSE),0)","v":2190.5700000000002},{"$f":"IFERROR(VLOOKUP($A136,Expended!$A$2:$J$198,7,FALSE),0)","v":0},{"$f":"IFERROR(VLOOKUP($A136,Expended!$A$2:$J$198,8,FALSE),0)","v":19155.34},{"$f":"IFERROR(VLOOKUP($A136,Expended!$A$2:$J$198,9,FALSE),0)","v":0},{"$f":"IFERROR(VLOOKUP($A136,Expended!$A$2:$J$198,10,FALSE),0)","v":10305028.09},{"$f":"IFERROR(VLOOKUP($A136,Expended!$A$2:$L$198,11,FALSE),0)","v":977898.7699999999},{"$f":"VLOOKUP($A136,Prior!$A$1:$K$199,5,FALSE)","v":130413.7},{"$f":"VLOOKUP($A136,Prior!$A$1:$K$199,6,FALSE)","v":2133161},{"$f":"VLOOKUP($A136,Prior!$A$1:$K$199,7,FALSE)","v":0},{"$f":"VLOOKUP($A136,Prior!$A$1:$K$199,8,FALSE)","v":8514692},{"$f":"VLOOKUP($A136,Prior!$A$1:$K$199,9,FALSE)","v":0},{"$f":"VLOOKUP($A136,Prior!$A$1:$K$199,10,FALSE)","v":205464.11},{"$f":"VLOOKUP($A136,Prior!$A$1:$K$199,11,FALSE)","v":186271.81},0,0,0,0,0,4812095.8,2663433.0299999998]
[273,"POST FALLS DISTRICT",76666767,{"$f":"IFERROR(VLOOKUP($A137,Awarded!$A$2:$J$196,4,FALSE),0)","v":77495.95},{"$f":"IFERROR(VLOOKUP($A137,Awarded!$A$2:$J$196,5,FALSE),0)","v":951128.72},{"$f":"IFERROR(VLOOKUP($A137,Awarded!$A$2:$J$196,6,FALSE),0)","v":0},{"$f":"IFERROR(VLOOKUP($A137,Awarded!$A$2:$J$196,7,FALSE),0)","v":3626587.35},{"$f":"IFERROR(VLOOKUP($A137,Awarded!$A$2:$J$196,8,FALSE),0)","v":0},{"$f":"IFERROR(VLOOKUP($A137,Awarded!$A$2:$J$196,9,FALSE),0)","v":6511564.8300000001},{"$f":"IFERROR(VLOOKUP($A137,Awarded!$A$2:$J$196,10,FALSE),0)","v":1626597.66},{"$f":"IFERROR(VLOOKUP($A137,Expended!$A$2:$J$198,5,FALSE),0)","v":294.52},{"$f":"IFERROR(VLOOKUP($A137,Expended!$A$2:$J$198,6,FALSE),0)","v":0},{"$f":"IFERROR(VLOOKUP($A137,Expended!$A$2:$J$198,7,FALSE),0)","v":0},{"$f":"IFERROR(VLOOKUP($A137,Expended!$A$2:$J$198,8,FALSE),0)","v":294283.53999999998},{"$f":"IFERROR(VLOOKUP($A137,Expended!$A$2:$J$198,9,FALSE),0)","v":0},{"$f":"IFERROR(VLOOKUP($A137,Expended!$A$2:$J$198,10,FALSE),0)","v":2554761.2999999998},{"$f":"IFERROR(VLOOKUP($A137,Expended!$A$2:$L$198,11,FALSE),0)","v":1314137.79},{"$f":"VLOOKUP($A137,Prior!$A$1:$K$199,5,FALSE)","v":74683},{"$f":"VLOOKUP($A137,Prior!$A$1:$K$199,6,FALSE)","v":950153},{"$f":"VLOOKUP($A137,Prior!$A$1:$K$199,7,FALSE)","v":0},{"$f":"VLOOKUP($A137,Prior!$A$1:$K$199,8,FALSE)","v":3332303.81},{"$f":"VLOOKUP($A137,Prior!$A$1:$K$199,9,FALSE)","v":0},{"$f":"VLOOKUP($A137,Prior!$A$1:$K$199,10,FALSE)","v":659089.69999999995},{"$f":"VLOOKUP($A137,Prior!$A$1:$K$199,11,FALSE)","v":311867.20999999996},2518.429999999993,975.71999999997206,0,0,0,3297713.83,592.65999999991618]
[285,"POTLATCH DISTRICT",100599133,{"$f":"IFERROR(VLOOKUP($A138,Awarded!$A$2:$J$196,4,FALSE),0)","v":13397.94},{"$f":"IFERROR(VLOOKUP($A138,Awarded!$A$2:$J$196,5,FALSE),0)","v":50778.09},{"$f":"IFERROR(VLOOKUP($A138,Awarded!$A$2:$J$196,6,FALSE),0)","v":11093.91},{"$f":"IFERROR(VLOOKUP($A138,Awarded!$A$2:$J$196,7,FALSE),0)","v":239490.57},{"$f":"IFERROR(VLOOKUP($A138,Awarded!$A$2:$J$196,8,FALSE),0)","v":0},{"$f":"IFERROR(VLOOKUP($A138,Awarded!$A$2:$J$196,9,FALSE),0)","v":430007.24},{"$f":"IFERROR(VLOOKUP($A138,Awarded!$A$2:$J$196,10,FALSE),0)","v":107416.14},{"$f":"IFERROR(VLOOKUP($A138,Expended!$A$2:$J$198,5,FALSE),0)","v":8269.94},{"$f":"IFERROR(VLOOKUP($A138,Expended!$A$2:$J$198,6,FALSE),0)","v":52.09},{"$f":"IFERROR(VLOOKUP($A138,Expended!$A$2:$J$198,7,FALSE),0)","v":0},{"$f":"IFERROR(VLOOKUP($A138,Expended!$A$2:$J$198,8,FALSE),0)","v":62780.479999999989},{"$f":"IFERROR(VLOOKUP($A138,Expended!$A$2:$J$198,9,FALSE),0)","v":0},{"$f":"IFERROR(VLOOKUP($A138,Expended!$A$2:$J$198,10,FALSE),0)","v":404359.48999999993},{"$f":"IFERROR(VLOOKUP($A138,Expended!$A$2:$L$198,11,FALSE),0)","v":25473.599999999999},{"$f":"VLOOKUP($A138,Prior!$A$1:$K$199,5,FALSE)","v":5128},{"$f":"VLOOKUP($A138,Prior!$A$1:$K$199,6,FALSE)","v":50726},{"$f":"VLOOKUP($A138,Prior!$A$1:$K$199,7,FALSE)","v":10867},{"$f":"VLOOKUP($A138,Prior!$A$1:$K$199,8,FALSE)","v":71082.92},{"$f":"VLOOKUP($A138,Prior!$A$1:$K$199,9,FALSE)","v":0},{"$f":"VLOOKUP($A138,Prior!$A$1:$K$199,10,FALSE)","v":25647.75},{"$f":"VLOOKUP($A138,Prior!$A$1:$K$199,11,FALSE)","v":22879.78},0,0,226.90999999999985,105627.17000000003,0,5.8207660913467407E-11,59062.760000000009]
[191,"Prairie Elementary District",159147461,{"$f":"IFERROR(VLOOKUP($A139,Awarded!$A$2:$J$196,4,FALSE),0)","v":8054.17},{"$f":"IFERROR(VLOOKUP($A139,Awarded!$A$2:$J$196,5,FALSE),0)","v":0},{"$f":"IFERROR(VLOOKUP($A139,Awarded!$A$2:$J$196,6,FALSE),0)","v":6464.22},{"$f":"IFERROR(VLOOKUP($A139,Awarded!$A$2:$J$196,7,FALSE),0)","v":0},{"$f":"IFERROR(VLOOKUP($A139,Awarded!$A$2:$J$196,8,FALSE),0)","v":349143},{"$f":"IFERROR(VLOOKUP($A139,Awarded!$A$2:$J$196,9,FALSE),0)","v":0},{"$f":"IFERROR(VLOOKUP($A139,Awarded!$A$2:$J$196,10,FALSE),0)","v":0},{"$f":"IFERROR(VLOOKUP($A139,Expended!$A$2:$J$198,5,FALSE),0)","v":0},{"$f":"IFERROR(VLOOKUP($A139,Expended!$A$2:$J$198,6,FALSE),0)","v":0},{"$f":"IFERROR(VLOOKUP($A139,Expended!$A$2:$J$198,7,FALSE),0)","v":0},{"$f":"IFERROR(VLOOKUP($A139,Expended!$A$2:$J$198,8,FALSE),0)","v":0},{"$f":"IFERROR(VLOOKUP($A139,Expended!$A$2:$J$198,9,FALSE),0)","v":0},{"$f":"IFERROR(VLOOKUP($A139,Expended!$A$2:$J$198,10,FALSE),0)","v":0},{"$f":"IFERROR(VLOOKUP($A139,Expended!$A$2:$L$198,11,FALSE),0)","v":0},{"$f":"VLOOKUP($A139,Prior!$A$1:$K$199,5,FALSE)","v":0},{"$f":"VLOOKUP($A139,Prior!$A$1:$K$199,6,FALSE)","v":0},{"$f":"VLOOKUP($A139,Prior!$A$1:$K$199,7,FALSE)","v":0},{"$f":"VLOOKUP($A139,Prior!$A$1:$K$199,8,FALSE)","v":0},{"$f":"VLOOKUP($A139,Prior!$A$1:$K$199,9,FALSE)","v":0},{"$f":"VLOOKUP($A139,Prior!$A$1:$K$199,10,FALSE)","v":0},{"$f":"VLOOKUP($A139,Prior!$A$1:$K$199,11,FALSE)","v":0},8054.17,0,6464.22,0,349143,0,0]
[201,"PRESTON JOINT DISTRICT",157817024,{"$f":"IFERROR(VLOOKUP($A140,Awarded!$A$2:$J$196,4,FALSE),0)","v":34493.94},{"$f":"IFERROR(VLOOKUP($A140,Awarded!$A$2:$J$196,5,FALSE),0)","v":193525.53},{"$f":"IFERROR(VLOOKUP($A140,Awarded!$A$2:$J$196,6,FALSE),0)","v":114368.27},{"$f":"IFERROR(VLOOKUP($A140,Awarded!$A$2:$J$196,7,FALSE),0)","v":850112.19},{"$f":"IFERROR(VLOOKUP($A140,Awarded!$A$2:$J$196,8,FALSE),0)","v":0},{"$f":"IFERROR(VLOOKUP($A140,Awarded!$A$2:$J$196,9,FALSE),0)","v":1526383.59},{"$f":"IFERROR(VLOOKUP($A140,Awarded!$A$2:$J$196,10,FALSE),0)","v":381292.93},{"$f":"IFERROR(VLOOKUP($A140,Expended!$A$2:$J$198,5,FALSE),0)","v":0},{"$f":"IFERROR(VLOOKUP($A140,Expended!$A$2:$J$198,6,FALSE),0)","v":0},{"$f":"IFERROR(VLOOKUP($A140,Expended!$A$2:$J$198,7,FALSE),0)","v":0},{"$f":"IFERROR(VLOOKUP($A140,Expended!$A$2:$J$198,8,FALSE),0)","v":0},{"$f":"IFERROR(VLOOKUP($A140,Expended!$A$2:$J$198,9,FALSE),0)","v":0},{"$f":"IFERROR(VLOOKUP($A140,Expended!$A$2:$J$198,10,FALSE),0)","v":183232.57},{"$f":"IFERROR(VLOOKUP($A140,Expended!$A$2:$L$198,11,FALSE),0)","v":71745.61},{"$f":"VLOOKUP($A140,Prior!$A$1:$K$199,5,FALSE)","v":33250},{"$f":"VLOOKUP($A140,Prior!$A$1:$K$199,6,FALSE)","v":193327},{"$f":"VLOOKUP($A140,Prior!$A$1:$K$199,7,FALSE)","v":112029},{"$f":"VLOOKUP($A140,Prior!$A$1:$K$199,8,FALSE)","v":848204},{"$f":"VLOOKUP($A140,Prior!$A$1:$K$199,9,FALSE)","v":0},{"$f":"VLOOKUP($A140,Prior!$A$1:$K$199,10,FALSE)","v":0},{"$f":"VLOOKUP($A140,Prior!$A$1:$K$199,11,FALSE)","v":0},1243.9400000000023,198.52999999999884,2339.2700000000041,1908.1899999999441,0,1343151.02,309547.32]
[513,"PROJECT IMPACT STEM ACADEMY, INC.",80846237,{"$f":"IFERROR(VLOOKUP($A141,Awarded!$A$2:$J$196,4,FALSE),0)","v":10382.5},{"$f":"IFERROR(VLOOKUP($A141,Awarded!$A$2:$J$196,5,FALSE),0)","v":33472.339999999997},{"$f":"IFERROR(VLOOKUP($A141,Awarded!$A$2:$J$196,6,FALSE),0)","v":0},{"$f":"IFERROR(VLOOKUP($A141,Awarded!$A$2:$J$196,7,FALSE),0)","v":161172.76999999999},{"$f":"IFERROR(VLOOKUP($A141,Awarded!$A$2:$J$196,8,FALSE),0)","v":72653},{"$f":"IFERROR(VLOOKUP($A141,Awarded!$A$2:$J$196,9,FALSE),0)","v":289387.31},{"$f":"IFERROR(VLOOKUP($A141,Awarded!$A$2:$J$196,10,FALSE),0)","v":72289.34},{"$f":"IFERROR(VLOOKUP($A141,Expended!$A$2:$J$198,5,FALSE),0)","v":324.20999999999998},{"$f":"IFERROR(VLOOKUP($A141,Expended!$A$2:$J$198,6,FALSE),0)","v":0},{"$f":"IFERROR(VLOOKUP($A141,Expended!$A$2:$J$198,7,FALSE),0)","v":0},{"$f":"IFERROR(VLOOKUP($A141,Expended!$A$2:$J$198,8,FALSE),0)","v":361.77},{"$f":"IFERROR(VLOOKUP($A141,Expended!$A$2:$J$198,9,FALSE),0)","v":72653},{"$f":"IFERROR(VLOOKUP($A141,Expended!$A$2:$J$198,10,FALSE),0)","v":155169.72},{"$f":"IFERROR(VLOOKUP($A141,Expended!$A$2:$L$198,11,FALSE),0)","v":9613.2200000000012},{"$f":"VLOOKUP($A141,Prior!$A$1:$K$199,5,FALSE)","v":10017},{"$f":"VLOOKUP($A141,Prior!$A$1:$K$199,6,FALSE)","v":33438},{"$f":"VLOOKUP($A141,Prior!$A$1:$K$199,7,FALSE)","v":0},{"$f":"VLOOKUP($A141,Prior!$A$1:$K$199,8,FALSE)","v":160811},{"$f":"VLOOKUP($A141,Prior!$A$1:$K$199,9,FALSE)","v":0},{"$f":"VLOOKUP($A141,Prior!$A$1:$K$199,10,FALSE)","v":127726.93000000001},{"$f":"VLOOKUP($A141,Prior!$A$1:$K$199,11,FALSE)","v":36168.32},41.290000000000873,34.339999999996508,0,0,0,6490.6599999999889,26507.799999999996]
[316,"RICHFIELD DISTRICT",29825924,{"$f":"IFERROR(VLOOKUP($A142,Awarded!$A$2:$J$196,4,FALSE),0)","v":10382.5},{"$f":"IFERROR(VLOOKUP($A142,Awarded!$A$2:$J$196,5,FALSE),0)","v":39615.64},{"$f":"IFERROR(VLOOKUP($A142,Awarded!$A$2:$J$196,6,FALSE),0)","v":0},{"$f":"IFERROR(VLOOKUP($A142,Awarded!$A$2:$J$196,7,FALSE),0)","v":180879.01},{"$f":"IFERROR(VLOOKUP($A142,Awarded!$A$2:$J$196,8,FALSE),0)","v":0},{"$f":"IFERROR(VLOOKUP($A142,Awarded!$A$2:$J$196,9,FALSE),0)","v":324770.31},{"$f":"IFERROR(VLOOKUP($A142,Awarded!$A$2:$J$196,10,FALSE),0)","v":81127.56},{"$f":"IFERROR(VLOOKUP($A142,Expended!$A$2:$J$198,5,FALSE),0)","v":7625.75},{"$f":"IFERROR(VLOOKUP($A142,Expended!$A$2:$J$198,6,FALSE),0)","v":0},{"$f":"IFERROR(VLOOKUP($A142,Expended!$A$2:$J$198,7,FALSE),0)","v":0},{"$f":"IFERROR(VLOOKUP($A142,Expended!$A$2:$J$198,8,FALSE),0)","v":38964.85},{"$f":"IFERROR(VLOOKUP($A142,Expended!$A$2:$J$198,9,FALSE),0)","v":0},{"$f":"IFERROR(VLOOKUP($A142,Expended!$A$2:$J$198,10,FALSE),0)","v":61109.24},{"$f":"IFERROR(VLOOKUP($A142,Expended!$A$2:$L$198,11,FALSE),0)","v":8698.36},{"$f":"VLOOKUP($A142,Prior!$A$1:$K$199,5,FALSE)","v":2439},{"$f":"VLOOKUP($A142,Prior!$A$1:$K$199,6,FALSE)","v":39575},{"$f":"VLOOKUP($A142,Prior!$A$1:$K$199,7,FALSE)","v":0},{"$f":"VLOOKUP($A142,Prior!$A$1:$K$199,8,FALSE)","v":0},{"$f":"VLOOKUP($A142,Prior!$A$1:$K$199,9,FALSE)","v":0},{"$f":"VLOOKUP($A142,Prior!$A$1:$K$199,10,FALSE)","v":61105.740000000005},{"$f":"VLOOKUP($A142,Prior!$A$1:$K$199,11,FALSE)","v":72399.64},317.75,40.639999999999418,0,141914.16,0,202555.33000000002,29.559999999997672]
[252,"RIRIE JOINT DISTRICT",926460742,{"$f":"IFERROR(VLOOKUP($A143,Awarded!$A$2:$J$196,4,FALSE),0)","v":16329.95},{"$f":"IFERROR(VLOOKUP($A143,Awarded!$A$2:$J$196,5,FALSE),0)","v":43245.36},{"$f":"IFERROR(VLOOKUP($A143,Awarded!$A$2:$J$196,6,FALSE),0)","v":139511.54999999999},{"$f":"IFERROR(VLOOKUP($A143,Awarded!$A$2:$J$196,7,FALSE),0)","v":169272.95999999999},{"$f":"IFERROR(VLOOKUP($A143,Awarded!$A$2:$J$196,8,FALSE),0)","v":0},{"$f":"IFERROR(VLOOKUP($A143,Awarded!$A$2:$J$196,9,FALSE),0)","v":303931.15999999997},{"$f":"IFERROR(VLOOKUP($A143,Awarded!$A$2:$J$196,10,FALSE),0)","v":75922.66},{"$f":"IFERROR(VLOOKUP($A143,Expended!$A$2:$J$198,5,FALSE),0)","v":3590.29},{"$f":"IFERROR(VLOOKUP($A143,Expended!$A$2:$J$198,6,FALSE),0)","v":44.36},{"$f":"IFERROR(VLOOKUP($A143,Expended!$A$2:$J$198,7,FALSE),0)","v":5853.29},{"$f":"IFERROR(VLOOKUP($A143,Expended!$A$2:$J$198,8,FALSE),0)","v":0},{"$f":"IFERROR(VLOOKUP($A143,Expended!$A$2:$J$198,9,FALSE),0)","v":0},{"$f":"IFERROR(VLOOKUP($A143,Expended!$A$2:$J$198,10,FALSE),0)","v":19024.759999999998},{"$f":"IFERROR(VLOOKUP($A143,Expended!$A$2:$L$198,11,FALSE),0)","v":18150.150000000001},{"$f":"VLOOKUP($A143,Prior!$A$1:$K$199,5,FALSE)","v":12737},{"$f":"VLOOKUP($A143,Prior!$A$1:$K$199,6,FALSE)","v":43201},{"$f":"VLOOKUP($A143,Prior!$A$1:$K$199,7,FALSE)","v":130042},{"$f":"VLOOKUP($A143,Prior!$A$1:$K$199,8,FALSE)","v":168893},{"$f":"VLOOKUP($A143,Prior!$A$1:$K$199,9,FALSE)","v":0},{"$f":"VLOOKUP($A143,Prior!$A$1:$K$199,10,FALSE)","v":0},{"$f":"VLOOKUP($A143,Prior!$A$1:$K$199,11,FALSE)","v":15081.779999999999},2.6599999999998545,0,3616.2599999999802,379.95999999999185,0,284906.39999999997,42690.73]
[382,"ROCKLAND DISTRICT",100187848,{"$f":"IFERROR(VLOOKUP($A144,Awarded!$A$2:$J$196,4,FALSE),0)","v":10384.68},{"$f":"IFERROR(VLOOKUP($A144,Awarded!$A$2:$J$196,5,FALSE),0)","v":18439.919999999998},{"$f":"IFERROR(VLOOKUP($A144,Awarded!$A$2:$J$196,6,FALSE),0)","v":20329.82},{"$f":"IFERROR(VLOOKUP($A144,Awarded!$A$2:$J$196,7,FALSE),0)","v":90037.1},{"$f":"IFERROR(VLOOKUP($A144,Awarded!$A$2:$J$196,8,FALSE),0)","v":148091},{"$f":"IFERROR(VLOOKUP($A144,Awarded!$A$2:$J$196,9,FALSE),0)","v":161662.32},{"$f":"IFERROR(VLOOKUP($A144,Awarded!$A$2:$J$196,10,FALSE),0)","v":40383.71},{"$f":"IFERROR(VLOOKUP($A144,Expended!$A$2:$J$198,5,FALSE),0)","v":8483},{"$f":"IFERROR(VLOOKUP($A144,Expended!$A$2:$J$198,6,FALSE),0)","v":3018.42},{"$f":"IFERROR(VLOOKUP($A144,Expended!$A$2:$J$198,7,FALSE),0)","v":6657.05},{"$f":"IFERROR(VLOOKUP($A144,Expended!$A$2:$J$198,8,FALSE),0)","v":64899.97},{"$f":"IFERROR(VLOOKUP($A144,Expended!$A$2:$J$198,9,FALSE),0)","v":0},{"$f":"IFERROR(VLOOKUP($A144,Expended!$A$2:$J$198,10,FALSE),0)","v":47574.78},{"$f":"IFERROR(VLOOKUP($A144,Expended!$A$2:$L$198,11,FALSE),0)","v":5280.1900000000005},{"$f":"VLOOKUP($A144,Prior!$A$1:$K$199,5,FALSE)","v":0},{"$f":"VLOOKUP($A144,Prior!$A$1:$K$199,6,FALSE)","v":15421.5},{"$f":"VLOOKUP($A144,Prior!$A$1:$K$199,7,FALSE)","v":0},{"$f":"VLOOKUP($A144,Prior!$A$1:$K$199,8,FALSE)","v":22871.11},{"$f":"VLOOKUP($A144,Prior!$A$1:$K$199,9,FALSE)","v":0},{"$f":"VLOOKUP($A144,Prior!$A$1:$K$199,10,FALSE)","v":0},{"$f":"VLOOKUP($A144,Prior!$A$1:$K$199,11,FALSE)","v":0},1901.6800000000003,0,13672.77,2266.0200000000041,148091,114087.54000000001,35103.519999999997]
[454,"ROLLING HILLS PUBLIC CHARTER SCHOOL, INC.",938170441,{"$f":"IFERROR(VLOOKUP($A145,Awarded!$A$2:$J$196,4,FALSE),0)","v":10726.869999999999},{"$f":"IFERROR(VLOOKUP($A145,Awarded!$A$2:$J$196,5,FALSE),0)","v":24380.01},{"$f":"IFERROR(VLOOKUP($A145,Awarded!$A$2:$J$196,6,FALSE),0)","v":1008.63},{"$f":"IFERROR(VLOOKUP($A145,Awarded!$A$2:$J$196,7,FALSE),0)","v":132227.79999999999},{"$f":"IFERROR(VLOOKUP($A145,Awarded!$A$2:$J$196,8,FALSE),0)","v":53879},{"$f":"IFERROR(VLOOKUP($A145,Awarded!$A$2:$J$196,9,FALSE),0)","v":237417.09},{"$f":"IFERROR(VLOOKUP($A145,Awarded!$A$2:$J$196,10,FALSE),0)","v":59306.61},{"$f":"IFERROR(VLOOKUP($A145,Expended!$A$2:$J$198,5,FALSE),0)","v":318.87},{"$f":"IFERROR(VLOOKUP($A145,Expended!$A$2:$J$198,6,FALSE),0)","v":25.01},{"$f":"IFERROR(VLOOKUP($A145,Expended!$A$2:$J$198,7,FALSE),0)","v":1008.63},{"$f":"IFERROR(VLOOKUP($A145,Expended!$A$2:$J$198,8,FALSE),0)","v":10300.64},{"$f":"IFERROR(VLOOKUP($A145,Expended!$A$2:$J$198,9,FALSE),0)","v":53877.38},{"$f":"IFERROR(VLOOKUP($A145,Expended!$A$2:$J$198,10,FALSE),0)","v":228853.49000000005},{"$f":"IFERROR(VLOOKUP($A145,Expended!$A$2:$L$198,11,FALSE),0)","v":56252.270000000004},{"$f":"VLOOKUP($A145,Prior!$A$1:$K$199,5,FALSE)","v":10408},{"$f":"VLOOKUP($A145,Prior!$A$1:$K$199,6,FALSE)","v":24355},{"$f":"VLOOKUP($A145,Prior!$A$1:$K$199,7,FALSE)","v":0},{"$f":"VLOOKUP($A145,Prior!$A$1:$K$199,8,FALSE)","v":121927.16},{"$f":"VLOOKUP($A145,Prior!$A$1:$K$199,9,FALSE)","v":0},{"$f":"VLOOKUP($A145,Prior!$A$1:$K$199,10,FALSE)","v":0},{"$f":"VLOOKUP($A145,Prior!$A$1:$K$199,11,FALSE)","v":0},0,0,0,0,1.6200000000026193,8563.5999999999476,3054.3399999999965]
[291,"SALMON DISTRICT",100015296,{"$f":"IFERROR(VLOOKUP($A146,Awarded!$A$2:$J$196,4,FALSE),0)","v":16677.439999999999},{"$f":"IFERROR(VLOOKUP($A146,Awarded!$A$2:$J$196,5,FALSE),0)","v":204267.55},{"$f":"IFERROR(VLOOKUP($A146,Awarded!$A$2:$J$196,6,FALSE),0)","v":0},{"$f":"IFERROR(VLOOKUP($A146,Awarded!$A$2:$J$196,7,FALSE),0)","v":816348.4},{"$f":"IFERROR(VLOOKUP($A146,Awarded!$A$2:$J$196,8,FALSE),0)","v":0},{"$f":"IFERROR(VLOOKUP($A146,Awarded!$A$2:$J$196,9,FALSE),0)","v":1465760.35},{"$f":"IFERROR(VLOOKUP($A146,Awarded!$A$2:$J$196,10,FALSE),0)","v":366148.41},{"$f":"IFERROR(VLOOKUP($A146,Expended!$A$2:$J$198,5,FALSE),0)","v":1847.44},{"$f":"IFERROR(VLOOKUP($A146,Expended!$A$2:$J$198,6,FALSE),0)","v":209.55},{"$f":"IFERROR(VLOOKUP($A146,Expended!$A$2:$J$198,7,FALSE),0)","v":0},{"$f":"IFERROR(VLOOKUP($A146,Expended!$A$2:$J$198,8,FALSE),0)","v":197743.47},{"$f":"IFERROR(VLOOKUP($A146,Expended!$A$2:$J$198,9,FALSE),0)","v":0},{"$f":"IFERROR(VLOOKUP($A146,Expended!$A$2:$J$198,10,FALSE),0)","v":0},{"$f":"IFERROR(VLOOKUP($A146,Expended!$A$2:$L$198,11,FALSE),0)","v":11533},{"$f":"VLOOKUP($A146,Prior!$A$1:$K$199,5,FALSE)","v":14830},{"$f":"VLOOKUP($A146,Prior!$A$1:$K$199,6,FALSE)","v":204058},{"$f":"VLOOKUP($A146,Prior!$A$1:$K$199,7,FALSE)","v":0},{"$f":"VLOOKUP($A146,Prior!$A$1:$K$199,8,FALSE)","v":411281.91999999998},{"$f":"VLOOKUP($A146,Prior!$A$1:$K$199,9,FALSE)","v":0},{"$f":"VLOOKUP($A146,Prior!$A$1:$K$199,10,FALSE)","v":0},{"$f":"VLOOKUP($A146,Prior!$A$1:$K$199,11,FALSE)","v":0},0,0,0,207323.01000000007,0,1465760.35,354615.41]
[243,"SALMON RIVER JOINT SCHOOL DISTRICT",806404062,{"$f":"IFERROR(VLOOKUP($A147,Awarded!$A$2:$J$196,4,FALSE),0)","v":9527.1299999999992},{"$f":"IFERROR(VLOOKUP($A147,Awarded!$A$2:$J$196,5,FALSE),0)","v":30432.22},{"$f":"IFERROR(VLOOKUP($A147,Awarded!$A$2:$J$196,6,FALSE),0)","v":1660.97},{"$f":"IFERROR(VLOOKUP($A147,Awarded!$A$2:$J$196,7,FALSE),0)","v":118267.47},{"$f":"IFERROR(VLOOKUP($A147,Awarded!$A$2:$J$196,8,FALSE),0)","v":85053},{"$f":"IFERROR(VLOOKUP($A147,Awarded!$A$2:$J$196,9,FALSE),0)","v":212350.05},{"$f":"IFERROR(VLOOKUP($A147,Awarded!$A$2:$J$196,10,FALSE),0)","v":53045.33},{"$f":"IFERROR(VLOOKUP($A147,Expended!$A$2:$J$198,5,FALSE),0)","v":2617.13},{"$f":"IFERROR(VLOOKUP($A147,Expended!$A$2:$J$198,6,FALSE),0)","v":31.22},{"$f":"IFERROR(VLOOKUP($A147,Expended!$A$2:$J$198,7,FALSE),0)","v":1660.97},{"$f":"IFERROR(VLOOKUP($A147,Expended!$A$2:$J$198,8,FALSE),0)","v":265.47000000000003},{"$f":"IFERROR(VLOOKUP($A147,Expended!$A$2:$J$198,9,FALSE),0)","v":85053},{"$f":"IFERROR(VLOOKUP($A147,Expended!$A$2:$J$198,10,FALSE),0)","v":212350.05},{"$f":"IFERROR(VLOOKUP($A147,Expended!$A$2:$L$198,11,FALSE),0)","v":53045.33},{"$f":"VLOOKUP($A147,Prior!$A$1:$K$199,5,FALSE)","v":6910},{"$f":"VLOOKUP($A147,Prior!$A$1:$K$199,6,FALSE)","v":30401},{"$f":"VLOOKUP($A147,Prior!$A$1:$K$199,7,FALSE)","v":0},{"$f":"VLOOKUP($A147,Prior!$A$1:$K$199,8,FALSE)","v":118002},{"$f":"VLOOKUP($A147,Prior!$A$1:$K$199,9,FALSE)","v":0},{"$f":"VLOOKUP($A147,Prior!$A$1:$K$199,10,FALSE)","v":0},{"$f":"VLOOKUP($A147,Prior!$A$1:$K$199,11,FALSE)","v":0},0,0,0,0,0,0,0]
[487,"SANDPOINT CHARTER SCHOOL, INC.",94295685,{"$f":"IFERROR(VLOOKUP($A148,Awarded!$A$2:$J$196,4,FALSE),0)","v":11564.289999999999},{"$f":"IFERROR(VLOOKUP($A148,Awarded!$A$2:$J$196,5,FALSE),0)","v":63571.22},{"$f":"IFERROR(VLOOKUP($A148,Awarded!$A$2:$J$196,6,FALSE),0)","v":0},{"$f":"IFERROR(VLOOKUP($A148,Awarded!$A$2:$J$196,7,FALSE),0)","v":254059.27},{"$f":"IFERROR(VLOOKUP($A148,Awarded!$A$2:$J$196,8,FALSE),0)","v":0},{"$f":"IFERROR(VLOOKUP($A148,Awarded!$A$2:$J$196,9,FALSE),0)","v":456164.55},{"$f":"IFERROR(VLOOKUP($A148,Awarded!$A$2:$J$196,10,FALSE),0)","v":113950.52},{"$f":"IFERROR(VLOOKUP($A148,Expended!$A$2:$J$198,5,FALSE),0)","v":407.29},{"$f":"IFERROR(VLOOKUP($A148,Expended!$A$2:$J$198,6,FALSE),0)","v":65.22},{"$f":"IFERROR(VLOOKUP($A148,Expended!$A$2:$J$198,7,FALSE),0)","v":0},{"$f":"IFERROR(VLOOKUP($A148,Expended!$A$2:$J$198,8,FALSE),0)","v":72019.960000000006},{"$f":"IFERROR(VLOOKUP($A148,Expended!$A$2:$J$198,9,FALSE),0)","v":0},{"$f":"IFERROR(VLOOKUP($A148,Expended!$A$2:$J$198,10,FALSE),0)","v":216769.79},{"$f":"IFERROR(VLOOKUP($A148,Expended!$A$2:$L$198,11,FALSE),0)","v":17827.04},{"$f":"VLOOKUP($A148,Prior!$A$1:$K$199,5,FALSE)","v":11157},{"$f":"VLOOKUP($A148,Prior!$A$1:$K$199,6,FALSE)","v":63506},{"$f":"VLOOKUP($A148,Prior!$A$1:$K$199,7,FALSE)","v":0},{"$f":"VLOOKUP($A148,Prior!$A$1:$K$199,8,FALSE)","v":182039.31},{"$f":"VLOOKUP($A148,Prior!$A$1:$K$199,9,FALSE)","v":0},{"$f":"VLOOKUP($A148,Prior!$A$1:$K$199,10,FALSE)","v":0},{"$f":"VLOOKUP($A148,Prior!$A$1:$K$199,11,FALSE)","v":15776.96},0,0,0,0,0,239394.75999999998,80346.520000000019]
[60,"SHELLEY JOINT DISTRICT",181965740,{"$f":"IFERROR(VLOOKUP($A149,Awarded!$A$2:$J$196,4,FALSE),0)","v":36743.19},{"$f":"IFERROR(VLOOKUP($A149,Awarded!$A$2:$J$196,5,FALSE),0)","v":212552.05},{"$f":"IFERROR(VLOOKUP($A149,Awarded!$A$2:$J$196,6,FALSE),0)","v":109002.52},{"$f":"IFERROR(VLOOKUP($A149,Awarded!$A$2:$J$196,7,FALSE),0)","v":849455.71},{"$f":"IFERROR(VLOOKUP($A149,Awarded!$A$2:$J$196,8,FALSE),0)","v":0},{"$f":"IFERROR(VLOOKUP($A149,Awarded!$A$2:$J$196,9,FALSE),0)","v":1525204.23},{"$f":"IFERROR(VLOOKUP($A149,Awarded!$A$2:$J$196,10,FALSE),0)","v":380997.82},{"$f":"IFERROR(VLOOKUP($A149,Expended!$A$2:$J$198,5,FALSE),0)","v":3774.19},{"$f":"IFERROR(VLOOKUP($A149,Expended!$A$2:$J$198,6,FALSE),0)","v":218.05},{"$f":"IFERROR(VLOOKUP($A149,Expended!$A$2:$J$198,7,FALSE),0)","v":8947.42},{"$f":"IFERROR(VLOOKUP($A149,Expended!$A$2:$J$198,8,FALSE),0)","v":166905.79999999999},{"$f":"IFERROR(VLOOKUP($A149,Expended!$A$2:$J$198,9,FALSE),0)","v":0},{"$f":"IFERROR(VLOOKUP($A149,Expended!$A$2:$J$198,10,FALSE),0)","v":1215323.74},{"$f":"IFERROR(VLOOKUP($A149,Expended!$A$2:$L$198,11,FALSE),0)","v":318883.53000000003},{"$f":"VLOOKUP($A149,Prior!$A$1:$K$199,5,FALSE)","v":32969},{"$f":"VLOOKUP($A149,Prior!$A$1:$K$199,6,FALSE)","v":212333.28},{"$f":"VLOOKUP($A149,Prior!$A$1:$K$199,7,FALSE)","v":100055.1},{"$f":"VLOOKUP($A149,Prior!$A$1:$K$199,8,FALSE)","v":682549.90999999992},{"$f":"VLOOKUP($A149,Prior!$A$1:$K$199,9,FALSE)","v":0},{"$f":"VLOOKUP($A149,Prior!$A$1:$K$199,10,FALSE)","v":247758.52000000002},{"$f":"VLOOKUP($A149,Prior!$A$1:$K$199,11,FALSE)","v":62114.29},0,0.72000000000116415,0,0,0,62121.969999999972,0]
[312,"SHOSHONE JOINT DISTRICT",193218260,{"$f":"IFERROR(VLOOKUP($A150,Awarded!$A$2:$J$196,4,FALSE),0)","v":13522.869999999999},{"$f":"IFERROR(VLOOKUP($A150,Awarded!$A$2:$J$196,5,FALSE),0)","v":85063.26},{"$f":"IFERROR(VLOOKUP($A150,Awarded!$A$2:$J$196,6,FALSE),0)","v":0},{"$f":"IFERROR(VLOOKUP($A150,Awarded!$A$2:$J$196,7,FALSE),0)","v":342296.33},{"$f":"IFERROR(VLOOKUP($A150,Awarded!$A$2:$J$196,8,FALSE),0)","v":0},{"$f":"IFERROR(VLOOKUP($A150,Awarded!$A$2:$J$196,9,FALSE),0)","v":614596.12},{"$f":"IFERROR(VLOOKUP($A150,Awarded!$A$2:$J$196,10,FALSE),0)","v":153526.94},{"$f":"IFERROR(VLOOKUP($A150,Expended!$A$2:$J$198,5,FALSE),0)","v":479.87},{"$f":"IFERROR(VLOOKUP($A150,Expended!$A$2:$J$198,6,FALSE),0)","v":87.26},{"$f":"IFERROR(VLOOKUP($A150,Expended!$A$2:$J$198,7,FALSE),0)","v":0},{"$f":"IFERROR(VLOOKUP($A150,Expended!$A$2:$J$198,8,FALSE),0)","v":0},{"$f":"IFERROR(VLOOKUP($A150,Expended!$A$2:$J$198,9,FALSE),0)","v":0},{"$f":"IFERROR(VLOOKUP($A150,Expended!$A$2:$J$198,10,FALSE),0)","v":44512.21},{"$f":"IFERROR(VLOOKUP($A150,Expended!$A$2:$L$198,11,FALSE),0)","v":110790.87999999999},{"$f":"VLOOKUP($A150,Prior!$A$1:$K$199,5,FALSE)","v":13043},{"$f":"VLOOKUP($A150,Prior!$A$1:$K$199,6,FALSE)","v":84976},{"$f":"VLOOKUP($A150,Prior!$A$1:$K$199,7,FALSE)","v":0},{"$f":"VLOOKUP($A150,Prior!$A$1:$K$199,8,FALSE)","v":95790.35},{"$f":"VLOOKUP($A150,Prior!$A$1:$K$199,9,FALSE)","v":0},{"$f":"VLOOKUP($A150,Prior!$A$1:$K$199,10,FALSE)","v":149451.98000000001},{"$f":"VLOOKUP($A150,Prior!$A$1:$K$199,11,FALSE)","v":36487.68},0,0,0,246505.98,0,420631.93000000005,6248.3800000000119]
[52,"SNAKE RIVER DISTRICT",29628674,{"$f":"IFERROR(VLOOKUP($A151,Awarded!$A$2:$J$196,4,FALSE),0)","v":28486.219999999998},{"$f":"IFERROR(VLOOKUP($A151,Awarded!$A$2:$J$196,5,FALSE),0)","v":306166.08},{"$f":"IFERROR(VLOOKUP($A151,Awarded!$A$2:$J$196,6,FALSE),0)","v":0},{"$f":"IFERROR(VLOOKUP($A151,Awarded!$A$2:$J$196,7,FALSE),0)","v":1049966.79},{"$f":"IFERROR(VLOOKUP($A151,Awarded!$A$2:$J$196,8,FALSE),0)","v":0},{"$f":"IFERROR(VLOOKUP($A151,Awarded!$A$2:$J$196,9,FALSE),0)","v":1885224.37},{"$f":"IFERROR(VLOOKUP($A151,Awarded!$A$2:$J$196,10,FALSE),0)","v":470931.59},{"$f":"IFERROR(VLOOKUP($A151,Expended!$A$2:$J$198,5,FALSE),0)","v":0},{"$f":"IFERROR(VLOOKUP($A151,Expended!$A$2:$J$198,6,FALSE),0)","v":0},{"$f":"IFERROR(VLOOKUP($A151,Expended!$A$2:$J$198,7,FALSE),0)","v":0},{"$f":"IFERROR(VLOOKUP($A151,Expended!$A$2:$J$198,8,FALSE),0)","v":111964.67},{"$f":"IFERROR(VLOOKUP($A151,Expended!$A$2:$J$198,9,FALSE),0)","v":0},{"$f":"IFERROR(VLOOKUP($A151,Expended!$A$2:$J$198,10,FALSE),0)","v":2184.37},{"$f":"IFERROR(VLOOKUP($A151,Expended!$A$2:$L$198,11,FALSE),0)","v":171.59},{"$f":"VLOOKUP($A151,Prior!$A$1:$K$199,5,FALSE)","v":27461},{"$f":"VLOOKUP($A151,Prior!$A$1:$K$199,6,FALSE)","v":305852},{"$f":"VLOOKUP($A151,Prior!$A$1:$K$199,7,FALSE)","v":0},{"$f":"VLOOKUP($A151,Prior!$A$1:$K$199,8,FALSE)","v":938002.12},{"$f":"VLOOKUP($A151,Prior!$A$1:$K$199,9,FALSE)","v":0},{"$f":"VLOOKUP($A151,Prior!$A$1:$K$199,10,FALSE)","v":1883040},{"$f":"VLOOKUP($A151,Prior!$A$1:$K$199,11,FALSE)","v":470760},1025.2199999999975,314.0800000000163,0,0,0,0,0]
[150,"SODA SPRINGS JOINT DISTRICT",878896901,{"$f":"IFERROR(VLOOKUP($A152,Awarded!$A$2:$J$196,4,FALSE),0)","v":18687.3},{"$f":"IFERROR(VLOOKUP($A152,Awarded!$A$2:$J$196,5,FALSE),0)","v":79805.87},{"$f":"IFERROR(VLOOKUP($A152,Awarded!$A$2:$J$196,6,FALSE),0)","v":88872.79},{"$f":"IFERROR(VLOOKUP($A152,Awarded!$A$2:$J$196,7,FALSE),0)","v":318939.90000000002},{"$f":"IFERROR(VLOOKUP($A152,Awarded!$A$2:$J$196,8,FALSE),0)","v":0},{"$f":"IFERROR(VLOOKUP($A152,Awarded!$A$2:$J$196,9,FALSE),0)","v":572659.53},{"$f":"IFERROR(VLOOKUP($A152,Awarded!$A$2:$J$196,10,FALSE),0)","v":143051.12},{"$f":"IFERROR(VLOOKUP($A152,Expended!$A$2:$J$198,5,FALSE),0)","v":764.3},{"$f":"IFERROR(VLOOKUP($A152,Expended!$A$2:$J$198,6,FALSE),0)","v":81.87},{"$f":"IFERROR(VLOOKUP($A152,Expended!$A$2:$J$198,7,FALSE),0)","v":482.93},{"$f":"IFERROR(VLOOKUP($A152,Expended!$A$2:$J$198,8,FALSE),0)","v":6170.9},{"$f":"IFERROR(VLOOKUP($A152,Expended!$A$2:$J$198,9,FALSE),0)","v":0},{"$f":"IFERROR(VLOOKUP($A152,Expended!$A$2:$J$198,10,FALSE),0)","v":100341.14},{"$f":"IFERROR(VLOOKUP($A152,Expended!$A$2:$L$198,11,FALSE),0)","v":7117.78},{"$f":"VLOOKUP($A152,Prior!$A$1:$K$199,5,FALSE)","v":17923},{"$f":"VLOOKUP($A152,Prior!$A$1:$K$199,6,FALSE)","v":79724},{"$f":"VLOOKUP($A152,Prior!$A$1:$K$199,7,FALSE)","v":87055},{"$f":"VLOOKUP($A152,Prior!$A$1:$K$199,8,FALSE)","v":312769},{"$f":"VLOOKUP($A152,Prior!$A$1:$K$199,9,FALSE)","v":0},{"$f":"VLOOKUP($A152,Prior!$A$1:$K$199,10,FALSE)","v":0},{"$f":"VLOOKUP($A152,Prior!$A$1:$K$199,11,FALSE)","v":0},0,0,1334.8600000000006,0,0,472318.39,135933.34]
[292,"SOUTH LEMHI DISTRICT",100187988,{"$f":"IFERROR(VLOOKUP($A153,Awarded!$A$2:$J$196,4,FALSE),0)","v":9180.5499999999993},{"$f":"IFERROR(VLOOKUP($A153,Awarded!$A$2:$J$196,5,FALSE),0)","v":19764.28},{"$f":"IFERROR(VLOOKUP($A153,Awarded!$A$2:$J$196,6,FALSE),0)","v":34384.29},{"$f":"IFERROR(VLOOKUP($A153,Awarded!$A$2:$J$196,7,FALSE),0)","v":67777.13},{"$f":"IFERROR(VLOOKUP($A153,Awarded!$A$2:$J$196,8,FALSE),0)","v":197797},{"$f":"IFERROR(VLOOKUP($A153,Awarded!$A$2:$J$196,9,FALSE),0)","v":121695.01},{"$f":"IFERROR(VLOOKUP($A153,Awarded!$A$2:$J$196,10,FALSE),0)","v":30400.080000000002},{"$f":"IFERROR(VLOOKUP($A153,Expended!$A$2:$J$198,5,FALSE),0)","v":2552.98},{"$f":"IFERROR(VLOOKUP($A153,Expended!$A$2:$J$198,6,FALSE),0)","v":20.28},{"$f":"IFERROR(VLOOKUP($A153,Expended!$A$2:$J$198,7,FALSE),0)","v":14.28},{"$f":"IFERROR(VLOOKUP($A153,Expended!$A$2:$J$198,8,FALSE),0)","v":2563.86},{"$f":"IFERROR(VLOOKUP($A153,Expended!$A$2:$J$198,9,FALSE),0)","v":67298.540000000008},{"$f":"IFERROR(VLOOKUP($A153,Expended!$A$2:$J$198,10,FALSE),0)","v":58069.259999999995},{"$f":"IFERROR(VLOOKUP($A153,Expended!$A$2:$L$198,11,FALSE),0)","v":30400.080000000002},{"$f":"VLOOKUP($A153,Prior!$A$1:$K$199,5,FALSE)","v":4753},{"$f":"VLOOKUP($A153,Prior!$A$1:$K$199,6,FALSE)","v":19744},{"$f":"VLOOKUP($A153,Prior!$A$1:$K$199,7,FALSE)","v":33666.720000000001},{"$f":"VLOOKUP($A153,Prior!$A$1:$K$199,8,FALSE)","v":65213.270000000004},{"$f":"VLOOKUP($A153,Prior!$A$1:$K$199,9,FALSE)","v":0},{"$f":"VLOOKUP($A153,Prior!$A$1:$K$199,10,FALSE)","v":63625.75},{"$f":"VLOOKUP($A153,Prior!$A$1:$K$199,11,FALSE)","v":0},1874.5699999999997,0,703.29000000000087,0,130498.45999999999,0,0]
[41,"ST MARIES JOINT DISTRICT",10205979,{"$f":"IFERROR(VLOOKUP($A154,Awarded!$A$2:$J$196,4,FALSE),0)","v":4060.58},{"$f":"IFERROR(VLOOKUP($A154,Awarded!$A$2:$J$196,5,FALSE),0)","v":132766.20000000001},{"$f":"IFERROR(VLOOKUP($A154,Awarded!$A$2:$J$196,6,FALSE),0)","v":0},{"$f":"IFERROR(VLOOKUP($A154,Awarded!$A$2:$J$196,7,FALSE),0)","v":530594.99},{"$f":"IFERROR(VLOOKUP($A154,Awarded!$A$2:$J$196,8,FALSE),0)","v":0},{"$f":"IFERROR(VLOOKUP($A154,Awarded!$A$2:$J$196,9,FALSE),0)","v":952686.84},{"$f":"IFERROR(VLOOKUP($A154,Awarded!$A$2:$J$196,10,FALSE),0)","v":237982.71},{"$f":"IFERROR(VLOOKUP($A154,Expended!$A$2:$J$198,5,FALSE),0)","v":66.58},{"$f":"IFERROR(VLOOKUP($A154,Expended!$A$2:$J$198,6,FALSE),0)","v":51543.77},{"$f":"IFERROR(VLOOKUP($A154,Expended!$A$2:$J$198,7,FALSE),0)","v":0},{"$f":"IFERROR(VLOOKUP($A154,Expended!$A$2:$J$198,8,FALSE),0)","v":530594.99},{"$f":"IFERROR(VLOOKUP($A154,Expended!$A$2:$J$198,9,FALSE),0)","v":0},{"$f":"IFERROR(VLOOKUP($A154,Expended!$A$2:$J$198,10,FALSE),0)","v":802903.01},{"$f":"IFERROR(VLOOKUP($A154,Expended!$A$2:$L$198,11,FALSE),0)","v":196572.39},{"$f":"VLOOKUP($A154,Prior!$A$1:$K$199,5,FALSE)","v":3994},{"$f":"VLOOKUP($A154,Prior!$A$1:$K$199,6,FALSE)","v":81222.429999999993},{"$f":"VLOOKUP($A154,Prior!$A$1:$K$199,7,FALSE)","v":0},{"$f":"VLOOKUP($A154,Prior!$A$1:$K$199,8,FALSE)","v":0},{"$f":"VLOOKUP($A154,Prior!$A$1:$K$199,9,FALSE)","v":0},{"$f":"VLOOKUP($A154,Prior!$A$1:$K$199,10,FALSE)","v":0},{"$f":"VLOOKUP($A154,Prior!$A$1:$K$199,11,FALSE)","v":0},0,0,0,0,0,149783.82999999996,41410.319999999978]
[322,"SUGAR-SALEM JOINT DISTRICT",58571670,{"$f":"IFERROR(VLOOKUP($A155,Awarded!$A$2:$J$196,4,FALSE),0)","v":25796},{"$f":"IFERROR(VLOOKUP($A155,Awarded!$A$2:$J$196,5,FALSE),0)","v":138760.35},{"$f":"IFERROR(VLOOKUP($A155,Awarded!$A$2:$J$196,6,FALSE),0)","v":41816.300000000003},{"$f":"IFERROR(VLOOKUP($A155,Awarded!$A$2:$J$196,7,FALSE),0)","v":708218.69},{"$f":"IFERROR(VLOOKUP($A155,Awarded!$A$2:$J$196,8,FALSE),0)","v":0},{"$f":"IFERROR(VLOOKUP($A155,Awarded!$A$2:$J$196,9,FALSE),0)","v":1270139},{"$f":"IFERROR(VLOOKUP($A155,Awarded!$A$2:$J$196,10,FALSE),0)","v":317535},{"$f":"IFERROR(VLOOKUP($A155,Expended!$A$2:$J$198,5,FALSE),0)","v":0},{"$f":"IFERROR(VLOOKUP($A155,Expended!$A$2:$J$198,6,FALSE),0)","v":142.35},{"$f":"IFERROR(VLOOKUP($A155,Expended!$A$2:$J$198,7,FALSE),0)","v":855.3},{"$f":"IFERROR(VLOOKUP($A155,Expended!$A$2:$J$198,8,FALSE),0)","v":255261.08},{"$f":"IFERROR(VLOOKUP($A155,Expended!$A$2:$J$198,9,FALSE),0)","v":0},{"$f":"IFERROR(VLOOKUP($A155,Expended!$A$2:$J$198,10,FALSE),0)","v":113368.71999999997},{"$f":"IFERROR(VLOOKUP($A155,Expended!$A$2:$L$198,11,FALSE),0)","v":253003.09999999998},{"$f":"VLOOKUP($A155,Prior!$A$1:$K$199,5,FALSE)","v":25796},{"$f":"VLOOKUP($A155,Prior!$A$1:$K$199,6,FALSE)","v":138618},{"$f":"VLOOKUP($A155,Prior!$A$1:$K$199,7,FALSE)","v":40961},{"$f":"VLOOKUP($A155,Prior!$A$1:$K$199,8,FALSE)","v":452957.61},{"$f":"VLOOKUP($A155,Prior!$A$1:$K$199,9,FALSE)","v":0},{"$f":"VLOOKUP($A155,Prior!$A$1:$K$199,10,FALSE)","v":7514.52},{"$f":"VLOOKUP($A155,Prior!$A$1:$K$199,11,FALSE)","v":64531.900000000009},0,0,0,0,0,1149255.76,0]
[92,"SWAN VALLEY ELEMENTARY DISTRICT",803155381,{"$f":"IFERROR(VLOOKUP($A156,Awarded!$A$2:$J$196,4,FALSE),0)","v":8694.94},{"$f":"IFERROR(VLOOKUP($A156,Awarded!$A$2:$J$196,5,FALSE),0)","v":0},{"$f":"IFERROR(VLOOKUP($A156,Awarded!$A$2:$J$196,6,FALSE),0)","v":27429.03},{"$f":"IFERROR(VLOOKUP($A156,Awarded!$A$2:$J$196,7,FALSE),0)","v":0},{"$f":"IFERROR(VLOOKUP($A156,Awarded!$A$2:$J$196,8,FALSE),0)","v":349143},{"$f":"IFERROR(VLOOKUP($A156,Awarded!$A$2:$J$196,9,FALSE),0)","v":0},{"$f":"IFERROR(VLOOKUP($A156,Awarded!$A$2:$J$196,10,FALSE),0)","v":0},{"$f":"IFERROR(VLOOKUP($A156,Expended!$A$2:$J$198,5,FALSE),0)","v":606.93999999999994},{"$f":"IFERROR(VLOOKUP($A156,Expended!$A$2:$J$198,6,FALSE),0)","v":0},{"$f":"IFERROR(VLOOKUP($A156,Expended!$A$2:$J$198,7,FALSE),0)","v":561.03},{"$f":"IFERROR(VLOOKUP($A156,Expended!$A$2:$J$198,8,FALSE),0)","v":0},{"$f":"IFERROR(VLOOKUP($A156,Expended!$A$2:$J$198,9,FALSE),0)","v":113655.49},{"$f":"IFERROR(VLOOKUP($A156,Expended!$A$2:$J$198,10,FALSE),0)","v":0},{"$f":"IFERROR(VLOOKUP($A156,Expended!$A$2:$L$198,11,FALSE),0)","v":0},{"$f":"VLOOKUP($A156,Prior!$A$1:$K$199,5,FALSE)","v":8088},{"$f":"VLOOKUP($A156,Prior!$A$1:$K$199,6,FALSE)","v":0},{"$f":"VLOOKUP($A156,Prior!$A$1:$K$199,7,FALSE)","v":26868},{"$f":"VLOOKUP($A156,Prior!$A$1:$K$199,8,FALSE)","v":0},{"$f":"VLOOKUP($A156,Prior!$A$1:$K$199,9,FALSE)","v":217582.73},{"$f":"VLOOKUP($A156,Prior!$A$1:$K$199,10,FALSE)","v":0},{"$f":"VLOOKUP($A156,Prior!$A$1:$K$199,11,FALSE)","v":0},0,0,0,0,17904.78,0,0]
[488,"SYRINGA MOUNTAIN SCHOOL, INC.",79390538,{"$f":"IFERROR(VLOOKUP($A157,Awarded!$A$2:$J$196,4,FALSE),0)","v":9202.7199999999993},{"$f":"IFERROR(VLOOKUP($A157,Awarded!$A$2:$J$196,5,FALSE),0)","v":20236.759999999998},{"$f":"IFERROR(VLOOKUP($A157,Awarded!$A$2:$J$196,6,FALSE),0)","v":0},{"$f":"IFERROR(VLOOKUP($A157,Awarded!$A$2:$J$196,7,FALSE),0)","v":69888.87},{"$f":"IFERROR(VLOOKUP($A157,Awarded!$A$2:$J$196,8,FALSE),0)","v":193081},{"$f":"IFERROR(VLOOKUP($A157,Awarded!$A$2:$J$196,9,FALSE),0)","v":125486.39999999999},{"$f":"IFERROR(VLOOKUP($A157,Awarded!$A$2:$J$196,10,FALSE),0)","v":31346.42},{"$f":"IFERROR(VLOOKUP($A157,Expended!$A$2:$J$198,5,FALSE),0)","v":37.61},{"$f":"IFERROR(VLOOKUP($A157,Expended!$A$2:$J$198,6,FALSE),0)","v":20.76},{"$f":"IFERROR(VLOOKUP($A157,Expended!$A$2:$J$198,7,FALSE),0)","v":0},{"$f":"IFERROR(VLOOKUP($A157,Expended!$A$2:$J$198,8,FALSE),0)","v":29861.09},{"$f":"IFERROR(VLOOKUP($A157,Expended!$A$2:$J$198,9,FALSE),0)","v":0},{"$f":"IFERROR(VLOOKUP($A157,Expended!$A$2:$J$198,10,FALSE),0)","v":124147.61},{"$f":"IFERROR(VLOOKUP($A157,Expended!$A$2:$L$198,11,FALSE),0)","v":18347.919999999998},{"$f":"VLOOKUP($A157,Prior!$A$1:$K$199,5,FALSE)","v":2226},{"$f":"VLOOKUP($A157,Prior!$A$1:$K$199,6,FALSE)","v":20216},{"$f":"VLOOKUP($A157,Prior!$A$1:$K$199,7,FALSE)","v":0},{"$f":"VLOOKUP($A157,Prior!$A$1:$K$199,8,FALSE)","v":40027.78},{"$f":"VLOOKUP($A157,Prior!$A$1:$K$199,9,FALSE)","v":0},{"$f":"VLOOKUP($A157,Prior!$A$1:$K$199,10,FALSE)","v":0},{"$f":"VLOOKUP($A157,Prior!$A$1:$K$199,11,FALSE)","v":0},6939.1099999999988,0,0,0,193081,1338.7899999999936,12998.5]
[461,"TAYLOR'S CROSSING PUBLIC CHARTER SCHOOL, INC.",797535601,{"$f":"IFERROR(VLOOKUP($A158,Awarded!$A$2:$J$196,4,FALSE),0)","v":14348},{"$f":"IFERROR(VLOOKUP($A158,Awarded!$A$2:$J$196,5,FALSE),0)","v":41276.339999999997},{"$f":"IFERROR(VLOOKUP($A158,Awarded!$A$2:$J$196,6,FALSE),0)","v":20771.86},{"$f":"IFERROR(VLOOKUP($A158,Awarded!$A$2:$J$196,7,FALSE),0)","v":159532.09},{"$f":"IFERROR(VLOOKUP($A158,Awarded!$A$2:$J$196,8,FALSE),0)","v":0},{"$f":"IFERROR(VLOOKUP($A158,Awarded!$A$2:$J$196,9,FALSE),0)","v":286441.89},{"$f":"IFERROR(VLOOKUP($A158,Awarded!$A$2:$J$196,10,FALSE),0)","v":71553.070000000007},{"$f":"IFERROR(VLOOKUP($A158,Expended!$A$2:$J$198,5,FALSE),0)","v":2606},{"$f":"IFERROR(VLOOKUP($A158,Expended!$A$2:$J$198,6,FALSE),0)","v":42.34},{"$f":"IFERROR(VLOOKUP($A158,Expended!$A$2:$J$198,7,FALSE),0)","v":424.86},{"$f":"IFERROR(VLOOKUP($A158,Expended!$A$2:$J$198,8,FALSE),0)","v":23185.26},{"$f":"IFERROR(VLOOKUP($A158,Expended!$A$2:$J$198,9,FALSE),0)","v":0},{"$f":"IFERROR(VLOOKUP($A158,Expended!$A$2:$J$198,10,FALSE),0)","v":84450.099999999991},{"$f":"IFERROR(VLOOKUP($A158,Expended!$A$2:$L$198,11,FALSE),0)","v":0},{"$f":"VLOOKUP($A158,Prior!$A$1:$K$199,5,FALSE)","v":11742},{"$f":"VLOOKUP($A158,Prior!$A$1:$K$199,6,FALSE)","v":41234},{"$f":"VLOOKUP($A158,Prior!$A$1:$K$199,7,FALSE)","v":20347},{"$f":"VLOOKUP($A158,Prior!$A$1:$K$199,8,FALSE)","v":136346.83000000002},{"$f":"VLOOKUP($A158,Prior!$A$1:$K$199,9,FALSE)","v":0},{"$f":"VLOOKUP($A158,Prior!$A$1:$K$199,10,FALSE)","v":65703.400000000009},{"$f":"VLOOKUP($A158,Prior!$A$1:$K$199,11,FALSE)","v":71526.999999999985},0,0,0,0,0,136288.39000000001,26.070000000021537]
[401,"TETON COUNTY DISTRICT",100599166,{"$f":"IFERROR(VLOOKUP($A159,Awarded!$A$2:$J$196,4,FALSE),0)","v":29375.84},{"$f":"IFERROR(VLOOKUP($A159,Awarded!$A$2:$J$196,5,FALSE),0)","v":205648.97},{"$f":"IFERROR(VLOOKUP($A159,Awarded!$A$2:$J$196,6,FALSE),0)","v":7865.89},{"$f":"IFERROR(VLOOKUP($A159,Awarded!$A$2:$J$196,7,FALSE),0)","v":821865.79},{"$f":"IFERROR(VLOOKUP($A159,Awarded!$A$2:$J$196,8,FALSE),0)","v":0},{"$f":"IFERROR(VLOOKUP($A159,Awarded!$A$2:$J$196,9,FALSE),0)","v":1475665.83},{"$f":"IFERROR(VLOOKUP($A159,Awarded!$A$2:$J$196,10,FALSE),0)","v":368623.31},{"$f":"IFERROR(VLOOKUP($A159,Expended!$A$2:$J$198,5,FALSE),0)","v":1057.8399999999999},{"$f":"IFERROR(VLOOKUP($A159,Expended!$A$2:$J$198,6,FALSE),0)","v":210.97},{"$f":"IFERROR(VLOOKUP($A159,Expended!$A$2:$J$198,7,FALSE),0)","v":160.88999999999999},{"$f":"IFERROR(VLOOKUP($A159,Expended!$A$2:$J$198,8,FALSE),0)","v":1844.79},{"$f":"IFERROR(VLOOKUP($A159,Expended!$A$2:$J$198,9,FALSE),0)","v":0},{"$f":"IFERROR(VLOOKUP($A159,Expended!$A$2:$J$198,10,FALSE),0)","v":362287.71},{"$f":"IFERROR(VLOOKUP($A159,Expended!$A$2:$L$198,11,FALSE),0)","v":168649.31},{"$f":"VLOOKUP($A159,Prior!$A$1:$K$199,5,FALSE)","v":28318},{"$f":"VLOOKUP($A159,Prior!$A$1:$K$199,6,FALSE)","v":205438},{"$f":"VLOOKUP($A159,Prior!$A$1:$K$199,7,FALSE)","v":7705},{"$f":"VLOOKUP($A159,Prior!$A$1:$K$199,8,FALSE)","v":820021},{"$f":"VLOOKUP($A159,Prior!$A$1:$K$199,9,FALSE)","v":0},{"$f":"VLOOKUP($A159,Prior!$A$1:$K$199,10,FALSE)","v":792144.82},{"$f":"VLOOKUP($A159,Prior!$A$1:$K$199,11,FALSE)","v":199974},0,0,0,0,0,321233.30000000016,0]
[460,"THE ACADEMY, INC.",783840858,{"$f":"IFERROR(VLOOKUP($A160,Awarded!$A$2:$J$196,4,FALSE),0)","v":14072.97},{"$f":"IFERROR(VLOOKUP($A160,Awarded!$A$2:$J$196,5,FALSE),0)","v":55028.45},{"$f":"IFERROR(VLOOKUP($A160,Awarded!$A$2:$J$196,6,FALSE),0)","v":46848.23},{"$f":"IFERROR(VLOOKUP($A160,Awarded!$A$2:$J$196,7,FALSE),0)","v":188711.59},{"$f":"IFERROR(VLOOKUP($A160,Awarded!$A$2:$J$196,8,FALSE),0)","v":0},{"$f":"IFERROR(VLOOKUP($A160,Awarded!$A$2:$J$196,9,FALSE),0)","v":338833.6},{"$f":"IFERROR(VLOOKUP($A160,Awarded!$A$2:$J$196,10,FALSE),0)","v":84640.84},{"$f":"IFERROR(VLOOKUP($A160,Expended!$A$2:$J$198,5,FALSE),0)","v":498.96999999999997},{"$f":"IFERROR(VLOOKUP($A160,Expended!$A$2:$J$198,6,FALSE),0)","v":55028.45},{"$f":"IFERROR(VLOOKUP($A160,Expended!$A$2:$J$198,7,FALSE),0)","v":0},{"$f":"IFERROR(VLOOKUP($A160,Expended!$A$2:$J$198,8,FALSE),0)","v":0},{"$f":"IFERROR(VLOOKUP($A160,Expended!$A$2:$J$198,9,FALSE),0)","v":0},{"$f":"IFERROR(VLOOKUP($A160,Expended!$A$2:$J$198,10,FALSE),0)","v":0},{"$f":"IFERROR(VLOOKUP($A160,Expended!$A$2:$L$198,11,FALSE),0)","v":0},{"$f":"VLOOKUP($A160,Prior!$A$1:$K$199,5,FALSE)","v":13574},{"$f":"VLOOKUP($A160,Prior!$A$1:$K$199,6,FALSE)","v":0},{"$f":"VLOOKUP($A160,Prior!$A$1:$K$199,7,FALSE)","v":0},{"$f":"VLOOKUP($A160,Prior!$A$1:$K$199,8,FALSE)","v":0},{"$f":"VLOOKUP($A160,Prior!$A$1:$K$199,9,FALSE)","v":0},{"$f":"VLOOKUP($A160,Prior!$A$1:$K$199,10,FALSE)","v":0},{"$f":"VLOOKUP($A160,Prior!$A$1:$K$199,11,FALSE)","v":0},0,0,46848.23,188711.59,0,338833.6,84640.84]
[470,"The Kootenai Bridge Academy, Inc.",831646554,{"$f":"IFERROR(VLOOKUP($A161,Awarded!$A$2:$J$196,4,FALSE),0)","v":0},{"$f":"IFERROR(VLOOKUP($A161,Awarded!$A$2:$J$196,5,FALSE),0)","v":0},{"$f":"IFERROR(VLOOKUP($A161,Awarded!$A$2:$J$196,6,FALSE),0)","v":172909.67},{"$f":"IFERROR(VLOOKUP($A161,Awarded!$A$2:$J$196,7,FALSE),0)","v":0},{"$f":"IFERROR(VLOOKUP($A161,Awarded!$A$2:$J$196,8,FALSE),0)","v":349143},{"$f":"IFERROR(VLOOKUP($A161,Awarded!$A$2:$J$196,9,FALSE),0)","v":0},{"$f":"IFERROR(VLOOKUP($A161,Awarded!$A$2:$J$196,10,FALSE),0)","v":0},{"$f":"IFERROR(VLOOKUP($A161,Expended!$A$2:$J$198,5,FALSE),0)","v":0},{"$f":"IFERROR(VLOOKUP($A161,Expended!$A$2:$J$198,6,FALSE),0)","v":0},{"$f":"IFERROR(VLOOKUP($A161,Expended!$A$2:$J$198,7,FALSE),0)","v":0},{"$f":"IFERROR(VLOOKUP($A161,Expended!$A$2:$J$198,8,FALSE),0)","v":0},{"$f":"IFERROR(VLOOKUP($A161,Expended!$A$2:$J$198,9,FALSE),0)","v":0},{"$f":"IFERROR(VLOOKUP($A161,Expended!$A$2:$J$198,10,FALSE),0)","v":0},{"$f":"IFERROR(VLOOKUP($A161,Expended!$A$2:$L$198,11,FALSE),0)","v":0},{"$f":"VLOOKUP($A161,Prior!$A$1:$K$199,5,FALSE)","v":0},{"$f":"VLOOKUP($A161,Prior!$A$1:$K$199,6,FALSE)","v":0},{"$f":"VLOOKUP($A161,Prior!$A$1:$K$199,7,FALSE)","v":0},{"$f":"VLOOKUP($A161,Prior!$A$1:$K$199,8,FALSE)","v":0},{"$f":"VLOOKUP($A161,Prior!$A$1:$K$199,9,FALSE)","v":0},{"$f":"VLOOKUP($A161,Prior!$A$1:$K$199,10,FALSE)","v":0},{"$f":"VLOOKUP($A161,Prior!$A$1:$K$199,11,FALSE)","v":0},0,0,172909.67,0,349143,0,0]
[494,"THE POCATELLO COMMUNITY CHARTER SCHOOL, INC.",113912443,{"$f":"IFERROR(VLOOKUP($A162,Awarded!$A$2:$J$196,4,FALSE),0)","v":14384.380000000001},{"$f":"IFERROR(VLOOKUP($A162,Awarded!$A$2:$J$196,5,FALSE),0)","v":45432.61},{"$f":"IFERROR(VLOOKUP($A162,Awarded!$A$2:$J$196,6,FALSE),0)","v":0},{"$f":"IFERROR(VLOOKUP($A162,Awarded!$A$2:$J$196,7,FALSE),0)","v":228213.25},{"$f":"IFERROR(VLOOKUP($A162,Awarded!$A$2:$J$196,8,FALSE),0)","v":0},{"$f":"IFERROR(VLOOKUP($A162,Awarded!$A$2:$J$196,9,FALSE),0)","v":409757.78},{"$f":"IFERROR(VLOOKUP($A162,Awarded!$A$2:$J$196,10,FALSE),0)","v":102358.29},{"$f":"IFERROR(VLOOKUP($A162,Expended!$A$2:$J$198,5,FALSE),0)","v":3929.8900000000003},{"$f":"IFERROR(VLOOKUP($A162,Expended!$A$2:$J$198,6,FALSE),0)","v":46.61},{"$f":"IFERROR(VLOOKUP($A162,Expended!$A$2:$J$198,7,FALSE),0)","v":0},{"$f":"IFERROR(VLOOKUP($A162,Expended!$A$2:$J$198,8,FALSE),0)","v":512.25},{"$f":"IFERROR(VLOOKUP($A162,Expended!$A$2:$J$198,9,FALSE),0)","v":0},{"$f":"IFERROR(VLOOKUP($A162,Expended!$A$2:$J$198,10,FALSE),0)","v":190511.94},{"$f":"IFERROR(VLOOKUP($A162,Expended!$A$2:$L$198,11,FALSE),0)","v":78956.48000000001},{"$f":"VLOOKUP($A162,Prior!$A$1:$K$199,5,FALSE)","v":10454.49},{"$f":"VLOOKUP($A162,Prior!$A$1:$K$199,6,FALSE)","v":45386},{"$f":"VLOOKUP($A162,Prior!$A$1:$K$199,7,FALSE)","v":0},{"$f":"VLOOKUP($A162,Prior!$A$1:$K$199,8,FALSE)","v":227701},{"$f":"VLOOKUP($A162,Prior!$A$1:$K$199,9,FALSE)","v":0},{"$f":"VLOOKUP($A162,Prior!$A$1:$K$199,10,FALSE)","v":22188.670000000002},{"$f":"VLOOKUP($A162,Prior!$A$1:$K$199,11,FALSE)","v":2085.2399999999998},0,0,0,0,0,197057.17,21316.569999999985]
[475,"THE SAGE INTERNATIONAL SCHOOL OF BOISE, A PUBLIC CHARTER SCHOOL, INC.",32655155,{"$f":"IFERROR(VLOOKUP($A163,Awarded!$A$2:$J$196,4,FALSE),0)","v":18935.689999999999},{"$f":"IFERROR(VLOOKUP($A163,Awarded!$A$2:$J$196,5,FALSE),0)","v":91611.98},{"$f":"IFERROR(VLOOKUP($A163,Awarded!$A$2:$J$196,6,FALSE),0)","v":35988.1},{"$f":"IFERROR(VLOOKUP($A163,Awarded!$A$2:$J$196,7,FALSE),0)","v":436186.08},{"$f":"IFERROR(VLOOKUP($A163,Awarded!$A$2:$J$196,8,FALSE),0)","v":0},{"$f":"IFERROR(VLOOKUP($A163,Awarded!$A$2:$J$196,9,FALSE),0)","v":783175.45},{"$f":"IFERROR(VLOOKUP($A163,Awarded!$A$2:$J$196,10,FALSE),0)","v":195638.28},{"$f":"IFERROR(VLOOKUP($A163,Expended!$A$2:$J$198,5,FALSE),0)","v":569.69000000000005},{"$f":"IFERROR(VLOOKUP($A163,Expended!$A$2:$J$198,6,FALSE),0)","v":93.98},{"$f":"IFERROR(VLOOKUP($A163,Expended!$A$2:$J$198,7,FALSE),0)","v":35988.1},{"$f":"IFERROR(VLOOKUP($A163,Expended!$A$2:$J$198,8,FALSE),0)","v":329058.11},{"$f":"IFERROR(VLOOKUP($A163,Expended!$A$2:$J$198,9,FALSE),0)","v":0},{"$f":"IFERROR(VLOOKUP($A163,Expended!$A$2:$J$198,10,FALSE),0)","v":142205.46},{"$f":"IFERROR(VLOOKUP($A163,Expended!$A$2:$L$198,11,FALSE),0)","v":51471.34},{"$f":"VLOOKUP($A163,Prior!$A$1:$K$199,5,FALSE)","v":18366},{"$f":"VLOOKUP($A163,Prior!$A$1:$K$199,6,FALSE)","v":91518},{"$f":"VLOOKUP($A163,Prior!$A$1:$K$199,7,FALSE)","v":0},{"$f":"VLOOKUP($A163,Prior!$A$1:$K$199,8,FALSE)","v":107127.97},{"$f":"VLOOKUP($A163,Prior!$A$1:$K$199,9,FALSE)","v":0},{"$f":"VLOOKUP($A163,Prior!$A$1:$K$199,10,FALSE)","v":458091.01},{"$f":"VLOOKUP($A163,Prior!$A$1:$K$199,11,FALSE)","v":144166.94},{"$f":"D163-K163-R163","v":0},{"$f":"E163-L163-S163","v":0},{"$f":"F163-M163-T163","v":0},{"$f":"G163-N163-U163","v":0},{"$f":"H163-O163-V163","v":0},{"$f":"I163-P163-W163","v":182878.97999999998},{"$f":"J163-Q163-X163","v":0}]
[473,"THE VILLAGE CHARTER SCHOOL, INC.",968901947,{"$f":"IFERROR(VLOOKUP($A164,Awarded!$A$2:$J$196,4,FALSE),0)","v":14419.19},{"$f":"IFERROR(VLOOKUP($A164,Awarded!$A$2:$J$196,5,FALSE),0)","v":30972.77},{"$f":"IFERROR(VLOOKUP($A164,Awarded!$A$2:$J$196,6,FALSE),0)","v":0},{"$f":"IFERROR(VLOOKUP($A164,Awarded!$A$2:$J$196,7,FALSE),0)","v":169266.94},{"$f":"IFERROR(VLOOKUP($A164,Awarded!$A$2:$J$196,8,FALSE),0)","v":0},{"$f":"IFERROR(VLOOKUP($A164,Awarded!$A$2:$J$196,9,FALSE),0)","v":303919.15000000002},{"$f":"IFERROR(VLOOKUP($A164,Awarded!$A$2:$J$196,10,FALSE),0)","v":75919.66},{"$f":"IFERROR(VLOOKUP($A164,Expended!$A$2:$J$198,5,FALSE),0)","v":3121.19},{"$f":"IFERROR(VLOOKUP($A164,Expended!$A$2:$J$198,6,FALSE),0)","v":31.77},{"$f":"IFERROR(VLOOKUP($A164,Expended!$A$2:$J$198,7,FALSE),0)","v":0},{"$f":"IFERROR(VLOOKUP($A164,Expended!$A$2:$J$198,8,FALSE),0)","v":0},{"$f":"IFERROR(VLOOKUP($A164,Expended!$A$2:$J$198,9,FALSE),0)","v":0},{"$f":"IFERROR(VLOOKUP($A164,Expended!$A$2:$J$198,10,FALSE),0)","v":93955},{"$f":"IFERROR(VLOOKUP($A164,Expended!$A$2:$L$198,11,FALSE),0)","v":69906.06},{"$f":"VLOOKUP($A164,Prior!$A$1:$K$199,5,FALSE)","v":11298},{"$f":"VLOOKUP($A164,Prior!$A$1:$K$199,6,FALSE)","v":30941},{"$f":"VLOOKUP($A164,Prior!$A$1:$K$199,7,FALSE)","v":0},{"$f":"VLOOKUP($A164,Prior!$A$1:$K$199,8,FALSE)","v":168887},{"$f":"VLOOKUP($A164,Prior!$A$1:$K$199,9,FALSE)","v":0},{"$f":"VLOOKUP($A164,Prior!$A$1:$K$199,10,FALSE)","v":21746.639999999999},{"$f":"VLOOKUP($A164,Prior!$A$1:$K$199,11,FALSE)","v":6013.6},0,0,0,379.94000000000233,0,188217.51,0]
[559,"THOMAS JEFFERSON CHARTER SCHOOL, INC.",784840469,{"$f":"IFERROR(VLOOKUP($A165,Awarded!$A$2:$J$196,4,FALSE),0)","v":12327.97},{"$f":"IFERROR(VLOOKUP($A165,Awarded!$A$2:$J$196,5,FALSE),0)","v":17379.830000000002},{"$f":"IFERROR(VLOOKUP($A165,Awarded!$A$2:$J$196,6,FALSE),0)","v":71734.240000000005},{"$f":"IFERROR(VLOOKUP($A165,Awarded!$A$2:$J$196,7,FALSE),0)","v":104027.5},{"$f":"IFERROR(VLOOKUP($A165,Awarded!$A$2:$J$196,8,FALSE),0)","v":116851},{"$f":"IFERROR(VLOOKUP($A165,Awarded!$A$2:$J$196,9,FALSE),0)","v":186782.42},{"$f":"IFERROR(VLOOKUP($A165,Awarded!$A$2:$J$196,10,FALSE),0)","v":46658},{"$f":"IFERROR(VLOOKUP($A165,Expended!$A$2:$J$198,5,FALSE),0)","v":472},{"$f":"IFERROR(VLOOKUP($A165,Expended!$A$2:$J$198,6,FALSE),0)","v":17.829999999999998},{"$f":"IFERROR(VLOOKUP($A165,Expended!$A$2:$J$198,7,FALSE),0)","v":0},{"$f":"IFERROR(VLOOKUP($A165,Expended!$A$2:$J$198,8,FALSE),0)","v":0},{"$f":"IFERROR(VLOOKUP($A165,Expended!$A$2:$J$198,9,FALSE),0)","v":14529.36},{"$f":"IFERROR(VLOOKUP($A165,Expended!$A$2:$J$198,10,FALSE),0)","v":6183.71},{"$f":"IFERROR(VLOOKUP($A165,Expended!$A$2:$L$198,11,FALSE),0)","v":325},{"$f":"VLOOKUP($A165,Prior!$A$1:$K$199,5,FALSE)","v":7499},{"$f":"VLOOKUP($A165,Prior!$A$1:$K$199,6,FALSE)","v":17362},{"$f":"VLOOKUP($A165,Prior!$A$1:$K$199,7,FALSE)","v":70267},{"$f":"VLOOKUP($A165,Prior!$A$1:$K$199,8,FALSE)","v":103794},{"$f":"VLOOKUP($A165,Prior!$A$1:$K$199,9,FALSE)","v":3024.25},{"$f":"VLOOKUP($A165,Prior!$A$1:$K$199,10,FALSE)","v":0},{"$f":"VLOOKUP($A165,Prior!$A$1:$K$199,11,FALSE)","v":0},4356.9699999999993,0,1467.2400000000052,233.5,99297.39,180598.71000000002,46333]
[416,"THREE CREEK JOINT ELEMENTARY DISTRICT",193613791,{"$f":"IFERROR(VLOOKUP($A166,Awarded!$A$2:$J$196,4,FALSE),0)","v":8088.43},{"$f":"IFERROR(VLOOKUP($A166,Awarded!$A$2:$J$196,5,FALSE),0)","v":0},{"$f":"IFERROR(VLOOKUP($A166,Awarded!$A$2:$J$196,6,FALSE),0)","v":6402.97},{"$f":"IFERROR(VLOOKUP($A166,Awarded!$A$2:$J$196,7,FALSE),0)","v":0},{"$f":"IFERROR(VLOOKUP($A166,Awarded!$A$2:$J$196,8,FALSE),0)","v":349143},{"$f":"IFERROR(VLOOKUP($A166,Awarded!$A$2:$J$196,9,FALSE),0)","v":0},{"$f":"IFERROR(VLOOKUP($A166,Awarded!$A$2:$J$196,10,FALSE),0)","v":0},{"$f":"IFERROR(VLOOKUP($A166,Expended!$A$2:$J$198,5,FALSE),0)","v":0},{"$f":"IFERROR(VLOOKUP($A166,Expended!$A$2:$J$198,6,FALSE),0)","v":0},{"$f":"IFERROR(VLOOKUP($A166,Expended!$A$2:$J$198,7,FALSE),0)","v":0},{"$f":"IFERROR(VLOOKUP($A166,Expended!$A$2:$J$198,8,FALSE),0)","v":0},{"$f":"IFERROR(VLOOKUP($A166,Expended!$A$2:$J$198,9,FALSE),0)","v":0},{"$f":"IFERROR(VLOOKUP($A166,Expended!$A$2:$J$198,10,FALSE),0)","v":0},{"$f":"IFERROR(VLOOKUP($A166,Expended!$A$2:$L$198,11,FALSE),0)","v":0},{"$f":"VLOOKUP($A166,Prior!$A$1:$K$199,5,FALSE)","v":5783},{"$f":"VLOOKUP($A166,Prior!$A$1:$K$199,6,FALSE)","v":0},{"$f":"VLOOKUP($A166,Prior!$A$1:$K$199,7,FALSE)","v":6272},{"$f":"VLOOKUP($A166,Prior!$A$1:$K$199,8,FALSE)","v":0},{"$f":"VLOOKUP($A166,Prior!$A$1:$K$199,9,FALSE)","v":0},{"$f":"VLOOKUP($A166,Prior!$A$1:$K$199,10,FALSE)","v":0},{"$f":"VLOOKUP($A166,Prior!$A$1:$K$199,11,FALSE)","v":0},2305.4300000000003,0,130.97000000000025,0,349143,0,0]
[532,"TREASURE VALLEY CLASSICAL ACADEMY, INC.",81137699,{"$f":"IFERROR(VLOOKUP($A167,Awarded!$A$2:$J$196,4,FALSE),0)","v":11430.3},{"$f":"IFERROR(VLOOKUP($A167,Awarded!$A$2:$J$196,5,FALSE),0)","v":24026.65},{"$f":"IFERROR(VLOOKUP($A167,Awarded!$A$2:$J$196,6,FALSE),0)","v":67238.28},{"$f":"IFERROR(VLOOKUP($A167,Awarded!$A$2:$J$196,7,FALSE),0)","v":175433.78},{"$f":"IFERROR(VLOOKUP($A167,Awarded!$A$2:$J$196,8,FALSE),0)","v":133422},{"$f":"IFERROR(VLOOKUP($A167,Awarded!$A$2:$J$196,9,FALSE),0)","v":314992.98},{"$f":"IFERROR(VLOOKUP($A167,Awarded!$A$2:$J$196,10,FALSE),0)","v":78682.67},{"$f":"IFERROR(VLOOKUP($A167,Expended!$A$2:$J$198,5,FALSE),0)","v":11430.3},{"$f":"IFERROR(VLOOKUP($A167,Expended!$A$2:$J$198,6,FALSE),0)","v":2231.4299999999998},{"$f":"IFERROR(VLOOKUP($A167,Expended!$A$2:$J$198,7,FALSE),0)","v":53522.59},{"$f":"IFERROR(VLOOKUP($A167,Expended!$A$2:$J$198,8,FALSE),0)","v":175433.78},{"$f":"IFERROR(VLOOKUP($A167,Expended!$A$2:$J$198,9,FALSE),0)","v":0},{"$f":"IFERROR(VLOOKUP($A167,Expended!$A$2:$J$198,10,FALSE),0)","v":0},{"$f":"IFERROR(VLOOKUP($A167,Expended!$A$2:$L$198,11,FALSE),0)","v":8311.82},{"$f":"VLOOKUP($A167,Prior!$A$1:$K$199,5,FALSE)","v":0},{"$f":"VLOOKUP($A167,Prior!$A$1:$K$199,6,FALSE)","v":21795.22},{"$f":"VLOOKUP($A167,Prior!$A$1:$K$199,7,FALSE)","v":0},{"$f":"VLOOKUP($A167,Prior!$A$1:$K$199,8,FALSE)","v":0},{"$f":"VLOOKUP($A167,Prior!$A$1:$K$199,9,FALSE)","v":0},{"$f":"VLOOKUP($A167,Prior!$A$1:$K$199,10,FALSE)","v":0},{"$f":"VLOOKUP($A167,Prior!$A$1:$K$199,11,FALSE)","v":0},0,0,13715.690000000002,0,133422,314992.98,70370.850000000006]
[287,"TROY SCHOOL DISTRICT",824948165,{"$f":"IFERROR(VLOOKUP($A168,Awarded!$A$2:$J$196,4,FALSE),0)","v":2641.55},{"$f":"IFERROR(VLOOKUP($A168,Awarded!$A$2:$J$196,5,FALSE),0)","v":22104.68},{"$f":"IFERROR(VLOOKUP($A168,Awarded!$A$2:$J$196,6,FALSE),0)","v":43346.61},{"$f":"IFERROR(VLOOKUP($A168,Awarded!$A$2:$J$196,7,FALSE),0)","v":102372.79},{"$f":"IFERROR(VLOOKUP($A168,Awarded!$A$2:$J$196,8,FALSE),0)","v":120547},{"$f":"IFERROR(VLOOKUP($A168,Awarded!$A$2:$J$196,9,FALSE),0)","v":183809.98},{"$f":"IFERROR(VLOOKUP($A168,Awarded!$A$2:$J$196,10,FALSE),0)","v":45915.73},{"$f":"IFERROR(VLOOKUP($A168,Expended!$A$2:$J$198,5,FALSE),0)","v":0},{"$f":"IFERROR(VLOOKUP($A168,Expended!$A$2:$J$198,6,FALSE),0)","v":0},{"$f":"IFERROR(VLOOKUP($A168,Expended!$A$2:$J$198,7,FALSE),0)","v":0},{"$f":"IFERROR(VLOOKUP($A168,Expended!$A$2:$J$198,8,FALSE),0)","v":43.08},{"$f":"IFERROR(VLOOKUP($A168,Expended!$A$2:$J$198,9,FALSE),0)","v":0},{"$f":"IFERROR(VLOOKUP($A168,Expended!$A$2:$J$198,10,FALSE),0)","v":37311.42},{"$f":"IFERROR(VLOOKUP($A168,Expended!$A$2:$L$198,11,FALSE),0)","v":29429.62},{"$f":"VLOOKUP($A168,Prior!$A$1:$K$199,5,FALSE)","v":2598},{"$f":"VLOOKUP($A168,Prior!$A$1:$K$199,6,FALSE)","v":22082},{"$f":"VLOOKUP($A168,Prior!$A$1:$K$199,7,FALSE)","v":0},{"$f":"VLOOKUP($A168,Prior!$A$1:$K$199,8,FALSE)","v":98506.42},{"$f":"VLOOKUP($A168,Prior!$A$1:$K$199,9,FALSE)","v":12671.35},{"$f":"VLOOKUP($A168,Prior!$A$1:$K$199,10,FALSE)","v":92985.209999999992},{"$f":"VLOOKUP($A168,Prior!$A$1:$K$199,11,FALSE)","v":16486.11},43.550000000000182,22.680000000000291,43346.61,3823.2899999999936,107875.65,53513.350000000006,0]
[411,"TWIN FALLS DISTRICT",100015353,{"$f":"IFERROR(VLOOKUP($A169,Awarded!$A$2:$J$196,4,FALSE),0)","v":116278.57},{"$f":"IFERROR(VLOOKUP($A169,Awarded!$A$2:$J$196,5,FALSE),0)","v":1502821.68},{"$f":"IFERROR(VLOOKUP($A169,Awarded!$A$2:$J$196,6,FALSE),0)","v":0},{"$f":"IFERROR(VLOOKUP($A169,Awarded!$A$2:$J$196,7,FALSE),0)","v":7137839.8200000003},{"$f":"IFERROR(VLOOKUP($A169,Awarded!$A$2:$J$196,8,FALSE),0)","v":0},{"$f":"IFERROR(VLOOKUP($A169,Awarded!$A$2:$J$196,9,FALSE),0)","v":12816045.720000001},{"$f":"IFERROR(VLOOKUP($A169,Awarded!$A$2:$J$196,10,FALSE),0)","v":3201465.48},{"$f":"IFERROR(VLOOKUP($A169,Expended!$A$2:$J$198,5,FALSE),0)","v":4227.57},{"$f":"IFERROR(VLOOKUP($A169,Expended!$A$2:$J$198,6,FALSE),0)","v":1541.68},{"$f":"IFERROR(VLOOKUP($A169,Expended!$A$2:$J$198,7,FALSE),0)","v":0},{"$f":"IFERROR(VLOOKUP($A169,Expended!$A$2:$J$198,8,FALSE),0)","v":1646195.11},{"$f":"IFERROR(VLOOKUP($A169,Expended!$A$2:$J$198,9,FALSE),0)","v":0},{"$f":"IFERROR(VLOOKUP($A169,Expended!$A$2:$J$198,10,FALSE),0)","v":3970009.38},{"$f":"IFERROR(VLOOKUP($A169,Expended!$A$2:$L$198,11,FALSE),0)","v":1147718.01},{"$f":"VLOOKUP($A169,Prior!$A$1:$K$199,5,FALSE)","v":112051},{"$f":"VLOOKUP($A169,Prior!$A$1:$K$199,6,FALSE)","v":1501280},{"$f":"VLOOKUP($A169,Prior!$A$1:$K$199,7,FALSE)","v":0},{"$f":"VLOOKUP($A169,Prior!$A$1:$K$199,8,FALSE)","v":5491644.71},{"$f":"VLOOKUP($A169,Prior!$A$1:$K$199,9,FALSE)","v":0},{"$f":"VLOOKUP($A169,Prior!$A$1:$K$199,10,FALSE)","v":330062.73},{"$f":"VLOOKUP($A169,Prior!$A$1:$K$199,11,FALSE)","v":2377.13},0,0,0,0,0,8515973.6099999994,2051370.34]
[486,"UPPER CARMEN PUBLIC CHARTER SCHOOL, INC.",186273954,{"$f":"IFERROR(VLOOKUP($A170,Awarded!$A$2:$J$196,4,FALSE),0)","v":2140.65},{"$f":"IFERROR(VLOOKUP($A170,Awarded!$A$2:$J$196,5,FALSE),0)","v":0},{"$f":"IFERROR(VLOOKUP($A170,Awarded!$A$2:$J$196,6,FALSE),0)","v":20480.91},{"$f":"IFERROR(VLOOKUP($A170,Awarded!$A$2:$J$196,7,FALSE),0)","v":0},{"$f":"IFERROR(VLOOKUP($A170,Awarded!$A$2:$J$196,8,FALSE),0)","v":349143},{"$f":"IFERROR(VLOOKUP($A170,Awarded!$A$2:$J$196,9,FALSE),0)","v":0},{"$f":"IFERROR(VLOOKUP($A170,Awarded!$A$2:$J$196,10,FALSE),0)","v":0},{"$f":"IFERROR(VLOOKUP($A170,Expended!$A$2:$J$198,5,FALSE),0)","v":0},{"$f":"IFERROR(VLOOKUP($A170,Expended!$A$2:$J$198,6,FALSE),0)","v":0},{"$f":"IFERROR(VLOOKUP($A170,Expended!$A$2:$J$198,7,FALSE),0)","v":1639.39},{"$f":"IFERROR(VLOOKUP($A170,Expended!$A$2:$J$198,8,FALSE),0)","v":0},{"$f":"IFERROR(VLOOKUP($A170,Expended!$A$2:$J$198,9,FALSE),0)","v":38699.19},{"$f":"IFERROR(VLOOKUP($A170,Expended!$A$2:$J$198,10,FALSE),0)","v":0},{"$f":"IFERROR(VLOOKUP($A170,Expended!$A$2:$L$198,11,FALSE),0)","v":0},{"$f":"VLOOKUP($A170,Prior!$A$1:$K$199,5,FALSE)","v":2111},{"$f":"VLOOKUP($A170,Prior!$A$1:$K$199,6,FALSE)","v":0},{"$f":"VLOOKUP($A170,Prior!$A$1:$K$199,7,FALSE)","v":18841.52},{"$f":"VLOOKUP($A170,Prior!$A$1:$K$199,8,FALSE)","v":0},{"$f":"VLOOKUP($A170,Prior!$A$1:$K$199,9,FALSE)","v":48180.819999999992},{"$f":"VLOOKUP($A170,Prior!$A$1:$K$199,10,FALSE)","v":0},{"$f":"VLOOKUP($A170,Prior!$A$1:$K$199,11,FALSE)","v":0},29.650000000000091,0,0,0,262262.99,0,0]
[262,"VALLEY DISTRICT",800469400,{"$f":"IFERROR(VLOOKUP($A171,Awarded!$A$2:$J$196,4,FALSE),0)","v":14941.029999999999},{"$f":"IFERROR(VLOOKUP($A171,Awarded!$A$2:$J$196,5,FALSE),0)","v":69420.22},{"$f":"IFERROR(VLOOKUP($A171,Awarded!$A$2:$J$196,6,FALSE),0)","v":0},{"$f":"IFERROR(VLOOKUP($A171,Awarded!$A$2:$J$196,7,FALSE),0)","v":318923.87},{"$f":"IFERROR(VLOOKUP($A171,Awarded!$A$2:$J$196,8,FALSE),0)","v":0},{"$f":"IFERROR(VLOOKUP($A171,Awarded!$A$2:$J$196,9,FALSE),0)","v":572629.5},{"$f":"IFERROR(VLOOKUP($A171,Awarded!$A$2:$J$196,10,FALSE),0)","v":143044.12},{"$f":"IFERROR(VLOOKUP($A171,Expended!$A$2:$J$198,5,FALSE),0)","v":738.03},{"$f":"IFERROR(VLOOKUP($A171,Expended!$A$2:$J$198,6,FALSE),0)","v":71.22},{"$f":"IFERROR(VLOOKUP($A171,Expended!$A$2:$J$198,7,FALSE),0)","v":0},{"$f":"IFERROR(VLOOKUP($A171,Expended!$A$2:$J$198,8,FALSE),0)","v":83666.83},{"$f":"IFERROR(VLOOKUP($A171,Expended!$A$2:$J$198,9,FALSE),0)","v":0},{"$f":"IFERROR(VLOOKUP($A171,Expended!$A$2:$J$198,10,FALSE),0)","v":146135.15},{"$f":"IFERROR(VLOOKUP($A171,Expended!$A$2:$L$198,11,FALSE),0)","v":143044.12},{"$f":"VLOOKUP($A171,Prior!$A$1:$K$199,5,FALSE)","v":14203},{"$f":"VLOOKUP($A171,Prior!$A$1:$K$199,6,FALSE)","v":69349},{"$f":"VLOOKUP($A171,Prior!$A$1:$K$199,7,FALSE)","v":0},{"$f":"VLOOKUP($A171,Prior!$A$1:$K$199,8,FALSE)","v":235257.04},{"$f":"VLOOKUP($A171,Prior!$A$1:$K$199,9,FALSE)","v":0},{"$f":"VLOOKUP($A171,Prior!$A$1:$K$199,10,FALSE)","v":0},{"$f":"VLOOKUP($A171,Prior!$A$1:$K$199,11,FALSE)","v":0},0,0,0,0,0,426494.35,0]
[139,"VALLIVUE SCHOOL DISTRICT",155896269,{"$f":"IFERROR(VLOOKUP($A172,Awarded!$A$2:$J$196,4,FALSE),0)","v":117127},{"$f":"IFERROR(VLOOKUP($A172,Awarded!$A$2:$J$196,5,FALSE),0)","v":1014808.05},{"$f":"IFERROR(VLOOKUP($A172,Awarded!$A$2:$J$196,6,FALSE),0)","v":20098.080000000002},{"$f":"IFERROR(VLOOKUP($A172,Awarded!$A$2:$J$196,7,FALSE),0)","v":4055640.42},{"$f":"IFERROR(VLOOKUP($A172,Awarded!$A$2:$J$196,8,FALSE),0)","v":0},{"$f":"IFERROR(VLOOKUP($A172,Awarded!$A$2:$J$196,9,FALSE),0)","v":7281933.4400000004},{"$f":"IFERROR(VLOOKUP($A172,Awarded!$A$2:$J$196,10,FALSE),0)","v":1819036.78},{"$f":"IFERROR(VLOOKUP($A172,Expended!$A$2:$J$198,5,FALSE),0)","v":5943},{"$f":"IFERROR(VLOOKUP($A172,Expended!$A$2:$J$198,6,FALSE),0)","v":1041.05},{"$f":"IFERROR(VLOOKUP($A172,Expended!$A$2:$J$198,7,FALSE),0)","v":411.08},{"$f":"IFERROR(VLOOKUP($A172,Expended!$A$2:$J$198,8,FALSE),0)","v":3204007.42},{"$f":"IFERROR(VLOOKUP($A172,Expended!$A$2:$J$198,9,FALSE),0)","v":0},{"$f":"IFERROR(VLOOKUP($A172,Expended!$A$2:$J$198,10,FALSE),0)","v":4275956.51},{"$f":"IFERROR(VLOOKUP($A172,Expended!$A$2:$L$198,11,FALSE),0)","v":207206.36000000002},{"$f":"VLOOKUP($A172,Prior!$A$1:$K$199,5,FALSE)","v":111184},{"$f":"VLOOKUP($A172,Prior!$A$1:$K$199,6,FALSE)","v":1013646.9999999999},{"$f":"VLOOKUP($A172,Prior!$A$1:$K$199,7,FALSE)","v":19687},{"$f":"VLOOKUP($A172,Prior!$A$1:$K$199,8,FALSE)","v":851633},{"$f":"VLOOKUP($A172,Prior!$A$1:$K$199,9,FALSE)","v":0},{"$f":"VLOOKUP($A172,Prior!$A$1:$K$199,10,FALSE)","v":632171.61},{"$f":"VLOOKUP($A172,Prior!$A$1:$K$199,11,FALSE)","v":221365.22000000003},0,120.00000000011642,0,0,0,2373805.3200000008,1390465.2]
[451,"VICTORY CHARTER SCHOOL, INC.",195571505,{"$f":"IFERROR(VLOOKUP($A173,Awarded!$A$2:$J$196,4,FALSE),0)","v":12442.72},{"$f":"IFERROR(VLOOKUP($A173,Awarded!$A$2:$J$196,5,FALSE),0)","v":41490.559999999998},{"$f":"IFERROR(VLOOKUP($A173,Awarded!$A$2:$J$196,6,FALSE),0)","v":48000.800000000003},{"$f":"IFERROR(VLOOKUP($A173,Awarded!$A$2:$J$196,7,FALSE),0)","v":142294.39999999999},{"$f":"IFERROR(VLOOKUP($A173,Awarded!$A$2:$J$196,8,FALSE),0)","v":31402},{"$f":"IFERROR(VLOOKUP($A173,Awarded!$A$2:$J$196,9,FALSE),0)","v":255490.03},{"$f":"IFERROR(VLOOKUP($A173,Awarded!$A$2:$J$196,10,FALSE),0)","v":63822.25},{"$f":"IFERROR(VLOOKUP($A173,Expended!$A$2:$J$198,5,FALSE),0)","v":393.72},{"$f":"IFERROR(VLOOKUP($A173,Expended!$A$2:$J$198,6,FALSE),0)","v":42.56},{"$f":"IFERROR(VLOOKUP($A173,Expended!$A$2:$J$198,7,FALSE),0)","v":981.8},{"$f":"IFERROR(VLOOKUP($A173,Expended!$A$2:$J$198,8,FALSE),0)","v":319.39999999999998},{"$f":"IFERROR(VLOOKUP($A173,Expended!$A$2:$J$198,9,FALSE),0)","v":0},{"$f":"IFERROR(VLOOKUP($A173,Expended!$A$2:$J$198,10,FALSE),0)","v":296.02999999999997},{"$f":"IFERROR(VLOOKUP($A173,Expended!$A$2:$L$198,11,FALSE),0)","v":18846.759999999998},{"$f":"VLOOKUP($A173,Prior!$A$1:$K$199,5,FALSE)","v":12049},{"$f":"VLOOKUP($A173,Prior!$A$1:$K$199,6,FALSE)","v":41448},{"$f":"VLOOKUP($A173,Prior!$A$1:$K$199,7,FALSE)","v":47019},{"$f":"VLOOKUP($A173,Prior!$A$1:$K$199,8,FALSE)","v":141975},{"$f":"VLOOKUP($A173,Prior!$A$1:$K$199,9,FALSE)","v":31402},{"$f":"VLOOKUP($A173,Prior!$A$1:$K$199,10,FALSE)","v":255194},{"$f":"VLOOKUP($A173,Prior!$A$1:$K$199,11,FALSE)","v":25260.69},0,0,0,0,0,0,19714.800000000007]
[463,"VISION CHARTER SCHOOL, INC.",7896716,{"$f":"IFERROR(VLOOKUP($A174,Awarded!$A$2:$J$196,4,FALSE),0)","v":18797.189999999999},{"$f":"IFERROR(VLOOKUP($A174,Awarded!$A$2:$J$196,5,FALSE),0)","v":59775.32},{"$f":"IFERROR(VLOOKUP($A174,Awarded!$A$2:$J$196,6,FALSE),0)","v":89758.92},{"$f":"IFERROR(VLOOKUP($A174,Awarded!$A$2:$J$196,7,FALSE),0)","v":242042.3},{"$f":"IFERROR(VLOOKUP($A174,Awarded!$A$2:$J$196,8,FALSE),0)","v":0},{"$f":"IFERROR(VLOOKUP($A174,Awarded!$A$2:$J$196,9,FALSE),0)","v":434588.55},{"$f":"IFERROR(VLOOKUP($A174,Awarded!$A$2:$J$196,10,FALSE),0)","v":108560.55},{"$f":"IFERROR(VLOOKUP($A174,Expended!$A$2:$J$198,5,FALSE),0)","v":2795.19},{"$f":"IFERROR(VLOOKUP($A174,Expended!$A$2:$J$198,6,FALSE),0)","v":61.32},{"$f":"IFERROR(VLOOKUP($A174,Expended!$A$2:$J$198,7,FALSE),0)","v":1835.92},{"$f":"IFERROR(VLOOKUP($A174,Expended!$A$2:$J$198,8,FALSE),0)","v":28543.439999999999},{"$f":"IFERROR(VLOOKUP($A174,Expended!$A$2:$J$198,9,FALSE),0)","v":0},{"$f":"IFERROR(VLOOKUP($A174,Expended!$A$2:$J$198,10,FALSE),0)","v":134867.13},{"$f":"IFERROR(VLOOKUP($A174,Expended!$A$2:$L$198,11,FALSE),0)","v":108560.55},{"$f":"VLOOKUP($A174,Prior!$A$1:$K$199,5,FALSE)","v":16002},{"$f":"VLOOKUP($A174,Prior!$A$1:$K$199,6,FALSE)","v":59714},{"$f":"VLOOKUP($A174,Prior!$A$1:$K$199,7,FALSE)","v":87923},{"$f":"VLOOKUP($A174,Prior!$A$1:$K$199,8,FALSE)","v":213498.86},{"$f":"VLOOKUP($A174,Prior!$A$1:$K$199,9,FALSE)","v":0},{"$f":"VLOOKUP($A174,Prior!$A$1:$K$199,10,FALSE)","v":0},{"$f":"VLOOKUP($A174,Prior!$A$1:$K$199,11,FALSE)","v":0},0,0,0,0,0,299721.42,0]
[393,"WALLACE DISTRICT",47780739,{"$f":"IFERROR(VLOOKUP($A175,Awarded!$A$2:$J$196,4,FALSE),0)","v":13578.279999999999},{"$f":"IFERROR(VLOOKUP($A175,Awarded!$A$2:$J$196,5,FALSE),0)","v":113956.9},{"$f":"IFERROR(VLOOKUP($A175,Awarded!$A$2:$J$196,6,FALSE),0)","v":0},{"$f":"IFERROR(VLOOKUP($A175,Awarded!$A$2:$J$196,7,FALSE),0)","v":537609.74},{"$f":"IFERROR(VLOOKUP($A175,Awarded!$A$2:$J$196,8,FALSE),0)","v":0},{"$f":"IFERROR(VLOOKUP($A175,Awarded!$A$2:$J$196,9,FALSE),0)","v":965281.45},{"$f":"IFERROR(VLOOKUP($A175,Awarded!$A$2:$J$196,10,FALSE),0)","v":241128.86},{"$f":"IFERROR(VLOOKUP($A175,Expended!$A$2:$J$198,5,FALSE),0)","v":481.28000000000003},{"$f":"IFERROR(VLOOKUP($A175,Expended!$A$2:$J$198,6,FALSE),0)","v":116.9},{"$f":"IFERROR(VLOOKUP($A175,Expended!$A$2:$J$198,7,FALSE),0)","v":0},{"$f":"IFERROR(VLOOKUP($A175,Expended!$A$2:$J$198,8,FALSE),0)","v":337217.13},{"$f":"IFERROR(VLOOKUP($A175,Expended!$A$2:$J$198,9,FALSE),0)","v":0},{"$f":"IFERROR(VLOOKUP($A175,Expended!$A$2:$J$198,10,FALSE),0)","v":2027.22},{"$f":"IFERROR(VLOOKUP($A175,Expended!$A$2:$L$198,11,FALSE),0)","v":96315.049999999988},{"$f":"VLOOKUP($A175,Prior!$A$1:$K$199,5,FALSE)","v":13097},{"$f":"VLOOKUP($A175,Prior!$A$1:$K$199,6,FALSE)","v":113840},{"$f":"VLOOKUP($A175,Prior!$A$1:$K$199,7,FALSE)","v":0},{"$f":"VLOOKUP($A175,Prior!$A$1:$K$199,8,FALSE)","v":199752.61},{"$f":"VLOOKUP($A175,Prior!$A$1:$K$199,9,FALSE)","v":0},{"$f":"VLOOKUP($A175,Prior!$A$1:$K$199,10,FALSE)","v":0},{"$f":"VLOOKUP($A175,Prior!$A$1:$K$199,11,FALSE)","v":0},0,0,0,640,0,963254.23,144813.81]
[431,"WEISER DISTRICT",181914961,{"$f":"IFERROR(VLOOKUP($A176,Awarded!$A$2:$J$196,4,FALSE),0)","v":5293.17},{"$f":"IFERROR(VLOOKUP($A176,Awarded!$A$2:$J$196,5,FALSE),0)","v":228582.49},{"$f":"IFERROR(VLOOKUP($A176,Awarded!$A$2:$J$196,6,FALSE),0)","v":0},{"$f":"IFERROR(VLOOKUP($A176,Awarded!$A$2:$J$196,7,FALSE),0)","v":1059038.1499999999},{"$f":"IFERROR(VLOOKUP($A176,Awarded!$A$2:$J$196,8,FALSE),0)","v":0},{"$f":"IFERROR(VLOOKUP($A176,Awarded!$A$2:$J$196,9,FALSE),0)","v":1901510.24},{"$f":"IFERROR(VLOOKUP($A176,Awarded!$A$2:$J$196,10,FALSE),0)","v":475000.07},{"$f":"IFERROR(VLOOKUP($A176,Expended!$A$2:$J$198,5,FALSE),0)","v":194.73},{"$f":"IFERROR(VLOOKUP($A176,Expended!$A$2:$J$198,6,FALSE),0)","v":0},{"$f":"IFERROR(VLOOKUP($A176,Expended!$A$2:$J$198,7,FALSE),0)","v":0},{"$f":"IFERROR(VLOOKUP($A176,Expended!$A$2:$J$198,8,FALSE),0)","v":329722.83},{"$f":"IFERROR(VLOOKUP($A176,Expended!$A$2:$J$198,9,FALSE),0)","v":0},{"$f":"IFERROR(VLOOKUP($A176,Expended!$A$2:$J$198,10,FALSE),0)","v":213566.8},{"$f":"IFERROR(VLOOKUP($A176,Expended!$A$2:$L$198,11,FALSE),0)","v":105315.11},{"$f":"VLOOKUP($A176,Prior!$A$1:$K$199,5,FALSE)","v":5098.4399999999996},{"$f":"VLOOKUP($A176,Prior!$A$1:$K$199,6,FALSE)","v":228348},{"$f":"VLOOKUP($A176,Prior!$A$1:$K$199,7,FALSE)","v":0},{"$f":"VLOOKUP($A176,Prior!$A$1:$K$199,8,FALSE)","v":724597.40999999992},{"$f":"VLOOKUP($A176,Prior!$A$1:$K$199,9,FALSE)","v":0},{"$f":"VLOOKUP($A176,Prior!$A$1:$K$199,10,FALSE)","v":3249},{"$f":"VLOOKUP($A176,Prior!$A$1:$K$199,11,FALSE)","v":34003.99},0,234.48999999999069,0,4717.9099999999162,0,1684694.44,335680.97000000003]
[232,"WENDELL DISTRICT",100015379,{"$f":"IFERROR(VLOOKUP($A177,Awarded!$A$2:$J$196,4,FALSE),0)","v":20724},{"$f":"IFERROR(VLOOKUP($A177,Awarded!$A$2:$J$196,5,FALSE),0)","v":154719.72},{"$f":"IFERROR(VLOOKUP($A177,Awarded!$A$2:$J$196,6,FALSE),0)","v":0},{"$f":"IFERROR(VLOOKUP($A177,Awarded!$A$2:$J$196,7,FALSE),0)","v":726153.95},{"$f":"IFERROR(VLOOKUP($A177,Awarded!$A$2:$J$196,8,FALSE),0)","v":0},{"$f":"IFERROR(VLOOKUP($A177,Awarded!$A$2:$J$196,9,FALSE),0)","v":1303814.71},{"$f":"IFERROR(VLOOKUP($A177,Awarded!$A$2:$J$196,10,FALSE),0)","v":325694.67},{"$f":"IFERROR(VLOOKUP($A177,Expended!$A$2:$J$198,5,FALSE),0)","v":4932},{"$f":"IFERROR(VLOOKUP($A177,Expended!$A$2:$J$198,6,FALSE),0)","v":158.72},{"$f":"IFERROR(VLOOKUP($A177,Expended!$A$2:$J$198,7,FALSE),0)","v":0},{"$f":"IFERROR(VLOOKUP($A177,Expended!$A$2:$J$198,8,FALSE),0)","v":61070.950000000004},{"$f":"IFERROR(VLOOKUP($A177,Expended!$A$2:$J$198,9,FALSE),0)","v":0},{"$f":"IFERROR(VLOOKUP($A177,Expended!$A$2:$J$198,10,FALSE),0)","v":947473.17},{"$f":"IFERROR(VLOOKUP($A177,Expended!$A$2:$L$198,11,FALSE),0)","v":76745},{"$f":"VLOOKUP($A177,Prior!$A$1:$K$199,5,FALSE)","v":15792},{"$f":"VLOOKUP($A177,Prior!$A$1:$K$199,6,FALSE)","v":154561},{"$f":"VLOOKUP($A177,Prior!$A$1:$K$199,7,FALSE)","v":0},{"$f":"VLOOKUP($A177,Prior!$A$1:$K$199,8,FALSE)","v":665083},{"$f":"VLOOKUP($A177,Prior!$A$1:$K$199,9,FALSE)","v":0},{"$f":"VLOOKUP($A177,Prior!$A$1:$K$199,10,FALSE)","v":0},{"$f":"VLOOKUP($A177,Prior!$A$1:$K$199,11,FALSE)","v":96700.98000000001},0,0,0,0,0,356341.53999999992,152248.68999999997]
[83,"WEST BONNER COUNTY DISTRICT",98834174,{"$f":"IFERROR(VLOOKUP($A178,Awarded!$A$2:$J$196,4,FALSE),0)","v":19733.09},{"$f":"IFERROR(VLOOKUP($A178,Awarded!$A$2:$J$196,5,FALSE),0)","v":377660.43},{"$f":"IFERROR(VLOOKUP($A178,Awarded!$A$2:$J$196,6,FALSE),0)","v":0},{"$f":"IFERROR(VLOOKUP($A178,Awarded!$A$2:$J$196,7,FALSE),0)","v":1371334.14},{"$f":"IFERROR(VLOOKUP($A178,Awarded!$A$2:$J$196,8,FALSE),0)","v":0},{"$f":"IFERROR(VLOOKUP($A178,Awarded!$A$2:$J$196,9,FALSE),0)","v":2462240.9500000002},{"$f":"IFERROR(VLOOKUP($A178,Awarded!$A$2:$J$196,10,FALSE),0)","v":615071.11},{"$f":"IFERROR(VLOOKUP($A178,Expended!$A$2:$J$198,5,FALSE),0)","v":0},{"$f":"IFERROR(VLOOKUP($A178,Expended!$A$2:$J$198,6,FALSE),0)","v":61700.88},{"$f":"IFERROR(VLOOKUP($A178,Expended!$A$2:$J$198,7,FALSE),0)","v":0},{"$f":"IFERROR(VLOOKUP($A178,Expended!$A$2:$J$198,8,FALSE),0)","v":970676.82000000007},{"$f":"IFERROR(VLOOKUP($A178,Expended!$A$2:$J$198,9,FALSE),0)","v":0},{"$f":"IFERROR(VLOOKUP($A178,Expended!$A$2:$J$198,10,FALSE),0)","v":0},{"$f":"IFERROR(VLOOKUP($A178,Expended!$A$2:$L$198,11,FALSE),0)","v":498139.62},{"$f":"VLOOKUP($A178,Prior!$A$1:$K$199,5,FALSE)","v":19027},{"$f":"VLOOKUP($A178,Prior!$A$1:$K$199,6,FALSE)","v":315959.55},{"$f":"VLOOKUP($A178,Prior!$A$1:$K$199,7,FALSE)","v":0},{"$f":"VLOOKUP($A178,Prior!$A$1:$K$199,8,FALSE)","v":4818.83},{"$f":"VLOOKUP($A178,Prior!$A$1:$K$199,9,FALSE)","v":0},{"$f":"VLOOKUP($A178,Prior!$A$1:$K$199,10,FALSE)","v":0},{"$f":"VLOOKUP($A178,Prior!$A$1:$K$199,11,FALSE)","v":116931.48999999999},706.09000000000015,0,0,395838.48999999982,0,2462240.9500000002,0]
[253,"WEST JEFFERSON DISTRICT",122332075,{"$f":"IFERROR(VLOOKUP($A179,Awarded!$A$2:$J$196,4,FALSE),0)","v":14799.960000000001},{"$f":"IFERROR(VLOOKUP($A179,Awarded!$A$2:$J$196,5,FALSE),0)","v":72103.97},{"$f":"IFERROR(VLOOKUP($A179,Awarded!$A$2:$J$196,6,FALSE),0)","v":31944.39},{"$f":"IFERROR(VLOOKUP($A179,Awarded!$A$2:$J$196,7,FALSE),0)","v":290735.59000000003},{"$f":"IFERROR(VLOOKUP($A179,Awarded!$A$2:$J$196,8,FALSE),0)","v":0},{"$f":"IFERROR(VLOOKUP($A179,Awarded!$A$2:$J$196,9,FALSE),0)","v":522018.85},{"$f":"IFERROR(VLOOKUP($A179,Awarded!$A$2:$J$196,10,FALSE),0)","v":130400.51},{"$f":"IFERROR(VLOOKUP($A179,Expended!$A$2:$J$198,5,FALSE),0)","v":682.96},{"$f":"IFERROR(VLOOKUP($A179,Expended!$A$2:$J$198,6,FALSE),0)","v":73.97},{"$f":"IFERROR(VLOOKUP($A179,Expended!$A$2:$J$198,7,FALSE),0)","v":0},{"$f":"IFERROR(VLOOKUP($A179,Expended!$A$2:$J$198,8,FALSE),0)","v":0},{"$f":"IFERROR(VLOOKUP($A179,Expended!$A$2:$J$198,9,FALSE),0)","v":0},{"$f":"IFERROR(VLOOKUP($A179,Expended!$A$2:$J$198,10,FALSE),0)","v":78169.19},{"$f":"IFERROR(VLOOKUP($A179,Expended!$A$2:$L$198,11,FALSE),0)","v":130353},{"$f":"VLOOKUP($A179,Prior!$A$1:$K$199,5,FALSE)","v":14117},{"$f":"VLOOKUP($A179,Prior!$A$1:$K$199,6,FALSE)","v":72030},{"$f":"VLOOKUP($A179,Prior!$A$1:$K$199,7,FALSE)","v":31291},{"$f":"VLOOKUP($A179,Prior!$A$1:$K$199,8,FALSE)","v":290083},{"$f":"VLOOKUP($A179,Prior!$A$1:$K$199,9,FALSE)","v":0},{"$f":"VLOOKUP($A179,Prior!$A$1:$K$199,10,FALSE)","v":0},{"$f":"VLOOKUP($A179,Prior!$A$1:$K$199,11,FALSE)","v":0},0,0,653.38999999999942,652.59000000002561,0,443849.66,47.509999999994761]
[202,"WEST SIDE JOINT DISTRICT",825388556,{"$f":"IFERROR(VLOOKUP($A180,Awarded!$A$2:$J$196,4,FALSE),0)","v":16413.38},{"$f":"IFERROR(VLOOKUP($A180,Awarded!$A$2:$J$196,5,FALSE),0)","v":59000.53},{"$f":"IFERROR(VLOOKUP($A180,Awarded!$A$2:$J$196,6,FALSE),0)","v":73565.7},{"$f":"IFERROR(VLOOKUP($A180,Awarded!$A$2:$J$196,7,FALSE),0)","v":265799.62},{"$f":"IFERROR(VLOOKUP($A180,Awarded!$A$2:$J$196,8,FALSE),0)","v":0},{"$f":"IFERROR(VLOOKUP($A180,Awarded!$A$2:$J$196,9,FALSE),0)","v":477244.97},{"$f":"IFERROR(VLOOKUP($A180,Awarded!$A$2:$J$196,10,FALSE),0)","v":119216.44},{"$f":"IFERROR(VLOOKUP($A180,Expended!$A$2:$J$198,5,FALSE),0)","v":584.38},{"$f":"IFERROR(VLOOKUP($A180,Expended!$A$2:$J$198,6,FALSE),0)","v":60.53},{"$f":"IFERROR(VLOOKUP($A180,Expended!$A$2:$J$198,7,FALSE),0)","v":1504.7},{"$f":"IFERROR(VLOOKUP($A180,Expended!$A$2:$J$198,8,FALSE),0)","v":127722.62},{"$f":"IFERROR(VLOOKUP($A180,Expended!$A$2:$J$198,9,FALSE),0)","v":0},{"$f":"IFERROR(VLOOKUP($A180,Expended!$A$2:$J$198,10,FALSE),0)","v":476692},{"$f":"IFERROR(VLOOKUP($A180,Expended!$A$2:$L$198,11,FALSE),0)","v":119173},{"$f":"VLOOKUP($A180,Prior!$A$1:$K$199,5,FALSE)","v":15829},{"$f":"VLOOKUP($A180,Prior!$A$1:$K$199,6,FALSE)","v":58940},{"$f":"VLOOKUP($A180,Prior!$A$1:$K$199,7,FALSE)","v":72061},{"$f":"VLOOKUP($A180,Prior!$A$1:$K$199,8,FALSE)","v":138077},{"$f":"VLOOKUP($A180,Prior!$A$1:$K$199,9,FALSE)","v":0},{"$f":"VLOOKUP($A180,Prior!$A$1:$K$199,10,FALSE)","v":0},{"$f":"VLOOKUP($A180,Prior!$A$1:$K$199,11,FALSE)","v":0},0,0,0,0,0,552.96999999997206,43.440000000002328]
[464,"WHITE PINE CHARTER SCHOOL, INC.",170300300,{"$f":"IFERROR(VLOOKUP($A181,Awarded!$A$2:$J$196,4,FALSE),0)","v":17456.189999999999},{"$f":"IFERROR(VLOOKUP($A181,Awarded!$A$2:$J$196,5,FALSE),0)","v":37606.58},{"$f":"IFERROR(VLOOKUP($A181,Awarded!$A$2:$J$196,6,FALSE),0)","v":98153.62},{"$f":"IFERROR(VLOOKUP($A181,Awarded!$A$2:$J$196,7,FALSE),0)","v":164573.41},{"$f":"IFERROR(VLOOKUP($A181,Awarded!$A$2:$J$196,8,FALSE),0)","v":0},{"$f":"IFERROR(VLOOKUP($A181,Awarded!$A$2:$J$196,9,FALSE),0)","v":295493.38},{"$f":"IFERROR(VLOOKUP($A181,Awarded!$A$2:$J$196,10,FALSE),0)","v":73814.89},{"$f":"IFERROR(VLOOKUP($A181,Expended!$A$2:$J$198,5,FALSE),0)","v":2795.19},{"$f":"IFERROR(VLOOKUP($A181,Expended!$A$2:$J$198,6,FALSE),0)","v":38.58},{"$f":"IFERROR(VLOOKUP($A181,Expended!$A$2:$J$198,7,FALSE),0)","v":2007.62},{"$f":"IFERROR(VLOOKUP($A181,Expended!$A$2:$J$198,8,FALSE),0)","v":369.41},{"$f":"IFERROR(VLOOKUP($A181,Expended!$A$2:$J$198,9,FALSE),0)","v":0},{"$f":"IFERROR(VLOOKUP($A181,Expended!$A$2:$J$198,10,FALSE),0)","v":342.38},{"$f":"IFERROR(VLOOKUP($A181,Expended!$A$2:$L$198,11,FALSE),0)","v":26.89},{"$f":"VLOOKUP($A181,Prior!$A$1:$K$199,5,FALSE)","v":14661},{"$f":"VLOOKUP($A181,Prior!$A$1:$K$199,6,FALSE)","v":37568},{"$f":"VLOOKUP($A181,Prior!$A$1:$K$199,7,FALSE)","v":96146},{"$f":"VLOOKUP($A181,Prior!$A$1:$K$199,8,FALSE)","v":164204},{"$f":"VLOOKUP($A181,Prior!$A$1:$K$199,9,FALSE)","v":0},{"$f":"VLOOKUP($A181,Prior!$A$1:$K$199,10,FALSE)","v":295151},{"$f":"VLOOKUP($A181,Prior!$A$1:$K$199,11,FALSE)","v":73788},0,0,0,0,0,0,0]
[288,"WHITEPINE JOINT SCHOOL DISTRICT",37409539,{"$f":"IFERROR(VLOOKUP($A182,Awarded!$A$2:$J$196,4,FALSE),0)","v":10676.68},{"$f":"IFERROR(VLOOKUP($A182,Awarded!$A$2:$J$196,5,FALSE),0)","v":25686.35},{"$f":"IFERROR(VLOOKUP($A182,Awarded!$A$2:$J$196,6,FALSE),0)","v":21995.94},{"$f":"IFERROR(VLOOKUP($A182,Awarded!$A$2:$J$196,7,FALSE),0)","v":123604.45},{"$f":"IFERROR(VLOOKUP($A182,Awarded!$A$2:$J$196,8,FALSE),0)","v":73136},{"$f":"IFERROR(VLOOKUP($A182,Awarded!$A$2:$J$196,9,FALSE),0)","v":221932.15},{"$f":"IFERROR(VLOOKUP($A182,Awarded!$A$2:$J$196,10,FALSE),0)","v":55439.199999999997},{"$f":"IFERROR(VLOOKUP($A182,Expended!$A$2:$J$198,5,FALSE),0)","v":0},{"$f":"IFERROR(VLOOKUP($A182,Expended!$A$2:$J$198,6,FALSE),0)","v":0},{"$f":"IFERROR(VLOOKUP($A182,Expended!$A$2:$J$198,7,FALSE),0)","v":449.94},{"$f":"IFERROR(VLOOKUP($A182,Expended!$A$2:$J$198,8,FALSE),0)","v":7035.7000000000007},{"$f":"IFERROR(VLOOKUP($A182,Expended!$A$2:$J$198,9,FALSE),0)","v":0},{"$f":"IFERROR(VLOOKUP($A182,Expended!$A$2:$J$198,10,FALSE),0)","v":188578.38999999998},{"$f":"IFERROR(VLOOKUP($A182,Expended!$A$2:$L$198,11,FALSE),0)","v":45857.120000000003},{"$f":"VLOOKUP($A182,Prior!$A$1:$K$199,5,FALSE)","v":10301},{"$f":"VLOOKUP($A182,Prior!$A$1:$K$199,6,FALSE)","v":25660},{"$f":"VLOOKUP($A182,Prior!$A$1:$K$199,7,FALSE)","v":21546},{"$f":"VLOOKUP($A182,Prior!$A$1:$K$199,8,FALSE)","v":116568.75},{"$f":"VLOOKUP($A182,Prior!$A$1:$K$199,9,FALSE)","v":0},{"$f":"VLOOKUP($A182,Prior!$A$1:$K$199,10,FALSE)","v":22986.43},{"$f":"VLOOKUP($A182,Prior!$A$1:$K$199,11,FALSE)","v":9582.08},375.68000000000029,26.349999999998545,0,0,73136,10367.330000000009,0]
[133,"WILDER DISTRICT",29650553,{"$f":"IFERROR(VLOOKUP($A183,Awarded!$A$2:$J$196,4,FALSE),0)","v":13826.13},{"$f":"IFERROR(VLOOKUP($A183,Awarded!$A$2:$J$196,5,FALSE),0)","v":179445.09},{"$f":"IFERROR(VLOOKUP($A183,Awarded!$A$2:$J$196,6,FALSE),0)","v":0},{"$f":"IFERROR(VLOOKUP($A183,Awarded!$A$2:$J$196,7,FALSE),0)","v":651591.57999999996},{"$f":"IFERROR(VLOOKUP($A183,Awarded!$A$2:$J$196,8,FALSE),0)","v":0},{"$f":"IFERROR(VLOOKUP($A183,Awarded!$A$2:$J$196,9,FALSE),0)","v":1169936.58},{"$f":"IFERROR(VLOOKUP($A183,Awarded!$A$2:$J$196,10,FALSE),0)","v":292251.48},{"$f":"IFERROR(VLOOKUP($A183,Expended!$A$2:$J$198,5,FALSE),0)","v":490.13},{"$f":"IFERROR(VLOOKUP($A183,Expended!$A$2:$J$198,6,FALSE),0)","v":184.12},{"$f":"IFERROR(VLOOKUP($A183,Expended!$A$2:$J$198,7,FALSE),0)","v":0},{"$f":"IFERROR(VLOOKUP($A183,Expended!$A$2:$J$198,8,FALSE),0)","v":229398.93},{"$f":"IFERROR(VLOOKUP($A183,Expended!$A$2:$J$198,9,FALSE),0)","v":0},{"$f":"IFERROR(VLOOKUP($A183,Expended!$A$2:$J$198,10,FALSE),0)","v":591047.92999999993},{"$f":"IFERROR(VLOOKUP($A183,Expended!$A$2:$L$198,11,FALSE),0)","v":179376.13000000003},{"$f":"VLOOKUP($A183,Prior!$A$1:$K$199,5,FALSE)","v":13336},{"$f":"VLOOKUP($A183,Prior!$A$1:$K$199,6,FALSE)","v":179260.97},{"$f":"VLOOKUP($A183,Prior!$A$1:$K$199,7,FALSE)","v":0},{"$f":"VLOOKUP($A183,Prior!$A$1:$K$199,8,FALSE)","v":422192.65},{"$f":"VLOOKUP($A183,Prior!$A$1:$K$199,9,FALSE)","v":0},{"$f":"VLOOKUP($A183,Prior!$A$1:$K$199,10,FALSE)","v":383553.70999999996},{"$f":"VLOOKUP($A183,Prior!$A$1:$K$199,11,FALSE)","v":0},0,0,0,0,0,195334.94000000018,112875.34999999995]
[462,"XAVIER CHARTER SCHOOL, INC.",3514777,{"$f":"IFERROR(VLOOKUP($A184,Awarded!$A$2:$J$196,4,FALSE),0)","v":6664.1900000000005},{"$f":"IFERROR(VLOOKUP($A184,Awarded!$A$2:$J$196,5,FALSE),0)","v":53609},{"$f":"IFERROR(VLOOKUP($A184,Awarded!$A$2:$J$196,6,FALSE),0)","v":101739.97},{"$f":"IFERROR(VLOOKUP($A184,Awarded!$A$2:$J$196,7,FALSE),0)","v":190304.16},{"$f":"IFERROR(VLOOKUP($A184,Awarded!$A$2:$J$196,8,FALSE),0)","v":0},{"$f":"IFERROR(VLOOKUP($A184,Awarded!$A$2:$J$196,9,FALSE),0)","v":341692.91},{"$f":"IFERROR(VLOOKUP($A184,Awarded!$A$2:$J$196,10,FALSE),0)","v":85355.12},{"$f":"IFERROR(VLOOKUP($A184,Expended!$A$2:$J$198,5,FALSE),0)","v":1584},{"$f":"IFERROR(VLOOKUP($A184,Expended!$A$2:$J$198,6,FALSE),0)","v":0},{"$f":"IFERROR(VLOOKUP($A184,Expended!$A$2:$J$198,7,FALSE),0)","v":256.56},{"$f":"IFERROR(VLOOKUP($A184,Expended!$A$2:$J$198,8,FALSE),0)","v":58196.37},{"$f":"IFERROR(VLOOKUP($A184,Expended!$A$2:$J$198,9,FALSE),0)","v":0},{"$f":"IFERROR(VLOOKUP($A184,Expended!$A$2:$J$198,10,FALSE),0)","v":77732.399999999994},{"$f":"IFERROR(VLOOKUP($A184,Expended!$A$2:$L$198,11,FALSE),0)","v":62198.779999999992},{"$f":"VLOOKUP($A184,Prior!$A$1:$K$199,5,FALSE)","v":5023},{"$f":"VLOOKUP($A184,Prior!$A$1:$K$199,6,FALSE)","v":53554},{"$f":"VLOOKUP($A184,Prior!$A$1:$K$199,7,FALSE)","v":99659},{"$f":"VLOOKUP($A184,Prior!$A$1:$K$199,8,FALSE)","v":86796.209999999992},{"$f":"VLOOKUP($A184,Prior!$A$1:$K$199,9,FALSE)","v":0},{"$f":"VLOOKUP($A184,Prior!$A$1:$K$199,10,FALSE)","v":13939.57},{"$f":"VLOOKUP($A184,Prior!$A$1:$K$199,11,FALSE)","v":23156.19},57.190000000000509,55,1824.4100000000035,45311.580000000016,0,250020.94,0.15000000000509317]
[4,"TEST LEA",101010,{"$f":"IFERROR(VLOOKUP($A185,Awarded!$A$2:$J$196,4,FALSE),0)","v":10000},{"$f":"IFERROR(VLOOKUP($A185,Awarded!$A$2:$J$196,5,FALSE),0)","v":6000},{"$f":"IFERROR(VLOOKUP($A185,Awarded!$A$2:$J$196,6,FALSE),0)","v":7000},{"$f":"IFERROR(VLOOKUP($A185,Awarded!$A$2:$J$196,7,FALSE),0)","v":8000},{"$f":"IFERROR(VLOOKUP($A185,Awarded!$A$2:$J$196,8,FALSE),0)","v":0},{"$f":"IFERROR(VLOOKUP($A185,Awarded!$A$2:$J$196,9,FALSE),0)","v":10000},{"$f":"IFERROR(VLOOKUP($A185,Awarded!$A$2:$J$196,10,FALSE),0)","v":11000},{"$f":"IFERROR(VLOOKUP($A185,Expended!$A$2:$J$198,5,FALSE),0)","v":10000},{"$f":"IFERROR(VLOOKUP($A185,Expended!$A$2:$J$198,6,FALSE),0)","v":5000},{"$f":"IFERROR(VLOOKUP($A185,Expended!$A$2:$J$198,7,FALSE),0)","v":3000},{"$f":"IFERROR(VLOOKUP($A185,Expended!$A$2:$J$198,8,FALSE),0)","v":8000},{"$f":"IFERROR(VLOOKUP($A185,Expended!$A$2:$J$198,9,FALSE),0)","v":0},{"$f":"IFERROR(VLOOKUP($A185,Expended!$A$2:$J$198,10,FALSE),0)","v":0},{"$f":"IFERROR(VLOOKUP($A185,Expended!$A$2:$L$198,11,FALSE),0)","v":0},{"$f":"VLOOKUP($A185,Prior!$A$1:$K$199,5,FALSE)","v":0},{"$f":"VLOOKUP($A185,Prior!$A$1:$K$199,6,FALSE)","v":0},{"$f":"VLOOKUP($A185,Prior!$A$1:$K$199,7,FALSE)","v":0},{"$f":"VLOOKUP($A185,Prior!$A$1:$K$199,8,FALSE)","v":0},{"$f":"VLOOKUP($A185,Prior!$A$1:$K$199,9,FALSE)","v":0},{"$f":"VLOOKUP($A185,Prior!$A$1:$K$199,10,FALSE)","v":0},{"$f":"VLOOKUP($A185,Prior!$A$1:$K$199,11,FALSE)","v":11000},0,1000,4000,0,0,10000,0]