{"text_format":"1","workbook":"xlsx","n_sheets":6,"sheets":["Welcome","Enter Student Data","Lookup Tool","--Cut Scores--","--Full Score Bands--","--Data List for Dropdowns--"],"not_rendered":{"charts":1,"images":3,"macros":1,"external_links":0,"defined_names":18,"comments":0,"pivot_tables":0},"unopened":[],"bounds":{"document_bytes":16777216,"sheet_cells":100000,"rows_first":2000,"rows_last":500,"rows_between":2000,"halvings":0,"cell_chars":16384,"cell_head_chars":4096},"cells_cut":0,"cells_raw":0,"read":"whole","date_system":"1900"}

{"sheet":"Welcome","index":0,"n_rows":6,"n_cols":1,"rows_kept":6,"cut":false,"hidden":false,"merged":[]}
["Welcome to the Student-Level Trajectory Report Generator for ACCESS 2.0\n\nThis analysis tool allows you to explore the scale score growth needed for students to be \"on track\" for future English language proficiency on the ACCESS 2.0 assessment.\n\nThe EL trajectory target for students in Idaho is reaching proficiency in seven years.\n\nSchool performance on this measure will be included on the Idaho Report Card. You can run these analyses for an individual student or for multiple students using the template provided. Follow the steps below to produce your trajectory report.\n"]
["1) Input Student Data"]
["2) Run Report"]
["Interested in exploring EL proficiency targets without creating a full student trajectory report? Use the Lookup Tool available in the Lookup Tool spreadsheet."]
["NOTES: Estimates are for informational purposes only and are intended to help illustrate the basic framework of the ACCESS 2.0 trajectory calculation. The calculations in this tool are a not a substitute for the trajectory calculations in Idaho's school accountability system. Please be aware that some high-achieving students may already have achieved a summative scale score above the target scale score for proficiency three years in the future. This tool will set their target growth at zero. The full business rules document, to be posted on the Idaho State Department of Education website, will include specifics on the official trajectory calculations."]
["End of worksheet"]

{"sheet":"Enter Student Data","index":1,"n_rows":3,"n_cols":6,"rows_kept":3,"cut":false,"hidden":false,"merged":[]}
["This sheet contains five columns where you need to enter ACCESS 2.0 composite scale scores to create an English Learner trajectory estimate. By default, there is sample entry in row 3 that you can replace. When complete, click the \"Done\" button or click on the \"Welcome\" spreadsheet. Note this tool does not create figures for separate domains."]
["EDUID","School","First Name ","Last Name","Last Year's Scale Score","Current Grade"]
[1000000,"Sample School","Test","Student",100,8]

{"sheet":"Lookup Tool","index":2,"n_rows":31,"n_cols":11,"rows_kept":31,"cut":false,"hidden":false,"merged":[]}
["This lookup tool allows you to enter different options for ACCESS 2.0 trajectory targets "]
["Lookup Tool"]
["The  two variables listed in the rows below \nallow you to generate trajectory targets","Enter the information in this row \nto explore different trajectory targets","Target Column"]
["Current Grade --->","Select a grade","J"]
["Last year's (i.e. 2017) Overall scale score --->",100,"Years Left"]
[null,"Reaching Proficiency in Seven Years \nor by the End of 12th Grade \n(whichever is closer)"]
["Target Overall scale score",{"$f":"C14","v":{"$error":"#VALUE!"}},{"$f":"IF(B4=7,6,IF(B4=8,5,IF(B4=9,4,IF(B4=10,3,IF(B4=11,2,IF(B4=12,1,7))))))","v":7},{"$f":"SUM(B4+2)","v":{"$error":"#VALUE!"}}]
["Total scale score growth needed to reach standard",{"$f":"MAX(C14-B5, 0)","v":{"$error":"#VALUE!"}},"Target Row"]
["Annual scale score growth needed (rounded up)",{"$f":"C16","v":{"$error":"#VALUE!"}}]
[null,null,{"$f":"SUM(C7+B4+3)","v":{"$error":"#VALUE!"}}]
[null,null,"Target Sheet"]
[null,null,{"$f":"\"'--Full Score Bands--'!\"","v":"'--Full Score Bands--'!"}]
[null,null,"Target Score"]
[null,null,{"$f":"INDIRECT(C12 & C4 & C10)","v":{"$error":"#VALUE!"}}]
[null,null,"Annual growth rounded up"]
[null,null,{"$f":"MAX(0, ROUNDUP((C14-B5) / C7, 0), 0)","v":{"$error":"#VALUE!"}}]
[]
[null,null,{"$f":"IF(B4 = \"ELA/Literacy\", \"D\", \"I\")","v":"I"}]
[null,null,{"$f":"IF(B4 = \"ELA/Literacy\", \"B\", \"K\")","v":"K"}]
[]
[]
[null,null,"Column --->","B","C","E","G","I","K","M"]
[null,"Year","Scale Score","Minimum","Level 1","Level 2","Level 3","Level 4","Level 5","Level 6"]
["Years",2017,{"$f":"B5","v":100}]
[1,2018,{"$f":"IF($C$7 >= A25, SUM(C24+$B$9), 0)","v":{"$error":"#VALUE!"}},{"$f":"INDIRECT($C$12 & D$22 & SUM($D$7+$A25))","v":{"$error":"#VALUE!"}},{"$f":"INDIRECT($C$12 & E$22 & SUM($D$7+$A25))-D25","v":{"$error":"#VALUE!"}},{"$f":"INDIRECT($C$12 & F$22 & SUM($D$7+$A25))-$D25-$E25","v":{"$error":"#VALUE!"}},{"$f":"INDIRECT($C$12 & G$22 & SUM($D$7+$A25))-$D25-$E25-$F25","v":{"$error":"#VALUE!"}},{"$f":"INDIRECT($C$12 & H$22 & SUM($D$7+$A25))-$D25-$E25-$F25-$G25","v":{"$error":"#VALUE!"}},{"$f":"INDIRECT($C$12 & I$22 & SUM($D$7+$A25))-$D25-$E25-$F25-$G25-$H25","v":{"$error":"#VALUE!"}},{"$f":"INDIRECT($C$12 & J$22 & SUM($D$7+$A25))-$D25-$E25-$F25-$G25-$H25-$I25","v":{"$error":"#VALUE!"}},{"$f":"SUM($B$5+A25-1)","v":100}]
[2,2019,{"$error":"#VALUE!"},{"$f":"INDIRECT($C$12 & D$22 & SUM($D$7+$A26))","v":{"$error":"#VALUE!"}},{"$f":"INDIRECT($C$12 & E$22 & SUM($D$7+$A26))-D26","v":{"$error":"#VALUE!"}},{"$f":"INDIRECT($C$12 & F$22 & SUM($D$7+$A26))-$D26-$E26","v":{"$error":"#VALUE!"}},{"$f":"INDIRECT($C$12 & G$22 & SUM($D$7+$A26))-$D26-$E26-$F26","v":{"$error":"#VALUE!"}},{"$f":"INDIRECT($C$12 & H$22 & SUM($D$7+$A26))-$D26-$E26-$F26-$G26","v":{"$error":"#VALUE!"}},{"$f":"INDIRECT($C$12 & I$22 & SUM($D$7+$A26))-$D26-$E26-$F26-$G26-$H26","v":{"$error":"#VALUE!"}},{"$f":"INDIRECT($C$12 & J$22 & SUM($D$7+$A26))-$D26-$E26-$F26-$G26-$H26-$I26","v":{"$error":"#VALUE!"}},101]
[3,2020,{"$error":"#VALUE!"},{"$error":"#VALUE!"},{"$error":"#VALUE!"},{"$error":"#VALUE!"},{"$error":"#VALUE!"},{"$error":"#VALUE!"},{"$error":"#VALUE!"},{"$error":"#VALUE!"},102]
[4,2021,{"$error":"#VALUE!"},{"$error":"#VALUE!"},{"$error":"#VALUE!"},{"$error":"#VALUE!"},{"$error":"#VALUE!"},{"$error":"#VALUE!"},{"$error":"#VALUE!"},{"$error":"#VALUE!"},103]
[5,2022,{"$error":"#VALUE!"},{"$error":"#VALUE!"},{"$f":"INDIRECT($C$12 & E$22 & SUM($D$7+$A29))-D29","v":{"$error":"#VALUE!"}},{"$error":"#VALUE!"},{"$error":"#VALUE!"},{"$error":"#VALUE!"},{"$error":"#VALUE!"},{"$error":"#VALUE!"},104]
[6,2023,{"$error":"#VALUE!"},{"$error":"#VALUE!"},{"$error":"#VALUE!"},{"$error":"#VALUE!"},{"$error":"#VALUE!"},{"$error":"#VALUE!"},{"$error":"#VALUE!"},{"$error":"#VALUE!"},105]
[7,2024,{"$error":"#VALUE!"},{"$error":"#VALUE!"},{"$f":"INDIRECT($C$12 & E$22 & SUM($D$7+$A31))-D31","v":{"$error":"#VALUE!"}},{"$error":"#VALUE!"},{"$error":"#VALUE!"},{"$error":"#VALUE!"},{"$error":"#VALUE!"},{"$error":"#VALUE!"},106]

{"sheet":"--Cut Scores--","index":3,"n_rows":14,"n_cols":10,"rows_kept":14,"cut":false,"hidden":true,"merged":[]}
["ELA Cut Scores",null,null,null,null,"Math Cut Scores"]
["Grade","Level 1","Level 2","Level 3","Level 4","Grade","Level 1","Level 2","Level 3","Level 4"]
[null,"From","From","From","From",null,"From","From","From","From"]
[3,2001,2367,2432,2490,3,2071,2381,2436,2501]
[4,2032,2416,2473,2533,4,2090,2411,2485,2549]
[5,2056,2442,2502,2582,5,2095,2455,2528,2579]
[6,2079,2457,2531,2618,6,2103,2473,2552,2610]
[7,2082,2479,2552,2649,7,2108,2484,2567,2635]
[8,2097,2487,2567,2668,8,2113,2504,2586,2653]
[9,2102,2488,2571,2670,9,2118,2515,2599,2676]
[10,2102,2491,2577,2677,10,2118,2529,2614,2697]
[11,2102,2493,2583,2682,11,2118,2543,2628,2718]
[]
["Source: http://idaho.portal.airast.org/wp-content/uploads/ELA-and-Math-Cut-Scores.pdf "]

{"sheet":"--Full Score Bands--","index":4,"n_rows":16,"n_cols":13,"rows_kept":16,"cut":false,"hidden":true,"merged":[[1,11,1,12],[1,1,1,2],[1,3,1,4],[1,5,1,6],[1,7,1,8],[1,9,1,10]]}
["ACCESS 2.0 Overall Cut Scores"]
["Grade","Level 1",null,"Level 2",null,"Level 3",null,"Level 4",null,"Level 5",null,"Level 6"]
[null,"From","To","From","To","From","To","From","To","From","To","From","To"]
[0,100,{"$f":"SUM(D4-1)","v":228},229,{"$f":"SUM(F4-1)","v":260},261,{"$f":"SUM(H4-1)","v":292},293,{"$f":"SUM(J4-1)","v":324},325,{"$f":"SUM(L4-1)","v":349},350,600]
[1,100,{"$f":"SUM(D5-1)","v":241},242,273,274,{"$f":"SUM(H5-1)","v":314},315,{"$f":"SUM(J5-1)","v":343},344,{"$f":"SUM(L5-1)","v":367},368,600]
[2,100,253,254,288,289,{"$f":"SUM(H6-1)","v":328},329,{"$f":"SUM(J6-1)","v":358},359,{"$f":"SUM(L6-1)","v":382},383,600]
[3,100,264,265,299,300,{"$f":"SUM(H7-1)","v":339},340,{"$f":"SUM(J7-1)","v":370},371,{"$f":"SUM(L7-1)","v":395},396,600]
[4,100,278,279,308,309,{"$f":"SUM(H8-1)","v":349},350,{"$f":"SUM(J8-1)","v":381},382,{"$f":"SUM(L8-1)","v":405},406,600]
[5,100,285,286,316,317,{"$f":"SUM(H9-1)","v":357},358,{"$f":"SUM(J9-1)","v":389},390,{"$f":"SUM(L9-1)","v":414},415,600]
[6,100,290,291,323,324,{"$f":"SUM(H10-1)","v":364},365,{"$f":"SUM(J10-1)","v":398},399,{"$f":"SUM(L10-1)","v":422},423,600]
[7,100,297,298,330,331,{"$f":"SUM(H11-1)","v":371},372,{"$f":"SUM(J11-1)","v":405},406,{"$f":"SUM(L11-1)","v":430},431,600]
[8,100,303,304,336,337,{"$f":"SUM(H12-1)","v":377},378,{"$f":"SUM(J12-1)","v":411},412,{"$f":"SUM(L12-1)","v":437},438,600]
[9,100,310,311,343,344,{"$f":"SUM(H13-1)","v":384},385,{"$f":"SUM(J13-1)","v":417},418,{"$f":"SUM(L13-1)","v":445},446,600]
[10,100,317,318,349,350,{"$f":"SUM(H14-1)","v":390},391,{"$f":"SUM(J14-1)","v":423},424,{"$f":"SUM(L14-1)","v":452},453,600]
[11,100,324,325,355,356,{"$f":"SUM(H15-1)","v":396},397,{"$f":"SUM(J15-1)","v":428},429,{"$f":"SUM(L15-1)","v":458},459,600]
[12,100,330,331,361,362,{"$f":"SUM(H16-1)","v":401},402,{"$f":"SUM(J16-1)","v":433},434,{"$f":"SUM(L16-1)","v":465},466,600]

{"sheet":"--Data List for Dropdowns--","index":5,"n_rows":504,"n_cols":29,"rows_kept":504,"cut":false,"hidden":true,"merged":[]}
["This is background data. Do not adjust."]
[]
["Grades",4,5,6,7,8,9,10,null,null,"Subject",null,"LookupSubjects","LookupGrades","LookupEndPoint",null,null,null,"Trajectory End Point","Trajectory End Point for Grade 10","Trajectory Based on",null,null,null,"Data Source",null,null,null,"Scores"]
["Select","Select a target end point","Select a target end point","Select a target end point","Select a target end point","Select a target end point","Select a target end point","Select a target end point",null,null,"ELA/Literacy",null,"Select a subject","Select a grade","Select a trajectory target",null,null,null,"Select a trajectory target","This school year","Select a trajectory calculation",null,null,null,"Online Reporting System (ORS)",null,null,null,100]
[{"$f":"IF(OR(#REF! > 0, 'Enter Student Data'!#REF!>0,#REF! > 0,#REF! > 0, 'Enter Student Data'!#REF!>0,#REF! > 0), \" \",  4)","v":{"$error":"#REF!"}},"This school year","This school year","This school year","This school year","This school year","10th grade","This school year",null,null,"Mathematics",null,"ELA/Literacy",1,"Reaching proficiency by the end of this year",null,null,null,"Three years",null,"Student's average annual growth",null,null,null,"Other",null,null,null,101]
[{"$f":"IF(OR(#REF! > 0, 'Enter Student Data'!#REF!>0,#REF! > 0), \" \",  5)","v":{"$error":"#REF!"}},"Three years from now","Three years from now","8th grade","8th grade",null,null,null,null,null,null,null,"Mathematics",2,"Reaching proficiency three years from now",null,null,null,"10th grade",null,"Student's growth last year",null,null,null,null,null,null,null,102]
[6,"8th grade","8th grade",null,null,null,null,null,null,null,null,null,null,3,"Reaching proficiency by the end of 8th grade",null,null,null,null,null,null,null,null,null,null,null,null,null,103]
[7,null,null,null,null,null,null,null,null,null,null,null,null,4,"Reaching proficiency by the end of 10th grade",null,null,null,null,null,null,null,null,null,null,null,null,null,104]
[8,null,null,null,null,null,null,null,null,null,null,null,null,5,null,null,null,null,null,null,null,null,null,null,null,null,null,null,105]
[null,null,null,null,null,null,null,null,null,null,null,null,null,6,null,null,null,null,null,null,null,null,null,null,null,null,null,null,106]
[null,null,null,null,null,null,null,null,null,null,null,null,null,7,null,null,null,null,null,null,null,null,null,null,null,null,null,null,107]
[null,null,null,null,null,null,null,null,null,null,null,null,null,8,null,null,null,null,null,null,null,null,null,null,null,null,null,null,108]
[null,null,null,null,null,null,null,null,null,null,null,null,null,9,null,null,null,null,null,null,null,null,null,null,null,null,null,null,109]
[null,null,null,null,null,null,null,null,null,null,null,null,null,10,null,null,null,null,null,null,null,null,null,null,null,null,null,null,110]
[null,null,null,null,null,null,null,null,null,null,null,null,null,11,null,null,null,null,null,null,null,null,null,null,null,null,null,null,111]
[null,null,null,null,null,null,null,null,null,null,null,null,null,12,null,null,null,null,null,null,null,null,null,null,null,null,null,null,112]
[null,null,null,null,null,null,null,null,null,null,null,null,null,null,null,null,null,null,null,null,null,null,null,null,null,null,null,null,113]
[null,null,null,null,null,null,null,null,null,null,null,null,null,null,null,null,null,null,null,null,null,null,null,null,null,null,null,null,114]
[null,null,null,null,null,null,null,null,null,null,null,null,null,null,null,null,null,null,null,null,null,null,null,null,null,null,null,null,115]
[null,null,null,null,null,null,null,null,null,null,null,null,null,null,null,null,null,null,null,null,null,null,null,null,null,null,null,null,116]
[null,null,null,null,null,null,null,null,null,null,null,null,null,null,null,null,null,null,null,null,null,null,null,null,null,null,null,null,117]
[null,null,null,null,null,null,null,null,null,null,null,null,null,null,null,null,null,null,null,null,null,null,null,null,null,null,null,null,118]
[null,null,null,null,null,null,null,null,null,null,null,null,null,null,null,null,null,null,null,null,null,null,null,null,null,null,null,null,119]
[null,null,null,null,null,null,null,null,null,null,null,null,null,null,null,null,null,null,null,null,null,null,null,null,null,null,null,null,120]
[null,null,null,null,null,null,null,null,null,null,null,null,null,null,null,null,null,null,null,null,null,null,null,null,null,null,null,null,121]
[null,null,null,null,null,null,null,null,null,null,null,null,null,null,null,null,null,null,null,null,null,null,null,null,null,null,null,null,122]
[null,null,null,null,null,null,null,null,null,null,null,null,null,null,null,null,null,null,null,null,null,null,null,null,null,null,null,null,123]
[null,null,null,null,null,null,null,null,null,null,null,null,null,null,null,null,null,null,null,null,null,null,null,null,null,null,null,null,124]
[null,null,null,null,null,null,null,null,null,null,null,null,null,null,null,null,null,null,null,null,null,null,null,null,null,null,null,null,125]
[null,null,null,null,null,null,null,null,null,null,null,null,null,null,null,null,null,null,null,null,null,null,null,null,null,null,null,null,126]
[null,null,null,null,null,null,null,null,null,null,null,null,null,null,null,null,null,null,null,null,null,null,null,null,null,null,null,null,127]
[null,null,null,null,null,null,null,null,null,null,null,null,null,null,null,null,null,null,null,null,null,null,null,null,null,null,null,null,128]
[null,null,null,null,null,null,null,null,null,null,null,null,null,null,null,null,null,null,null,null,null,null,null,null,null,null,null,null,129]
[null,null,null,null,null,null,null,null,null,null,null,null,null,null,null,null,null,null,null,null,null,null,null,null,null,null,null,null,130]
[null,null,null,null,null,null,null,null,null,null,null,null,null,null,null,null,null,null,null,null,null,null,null,null,null,null,null,null,131]
[null,null,null,null,null,null,null,null,null,null,null,null,null,null,null,null,null,null,null,null,null,null,null,null,null,null,null,null,132]
[null,null,null,null,null,null,null,null,null,null,null,null,null,null,null,null,null,null,null,null,null,null,null,null,null,null,null,null,133]
[null,null,null,null,null,null,null,null,null,null,null,null,null,null,null,null,null,null,null,null,null,null,null,null,null,null,null,null,134]
[null,null,null,null,null,null,null,null,null,null,null,null,null,null,null,null,null,null,null,null,null,null,null,null,null,null,null,null,135]
[null,null,null,null,null,null,null,null,null,null,null,null,null,null,null,null,null,null,null,null,null,null,null,null,null,null,null,null,136]
[null,null,null,null,null,null,null,null,null,null,null,null,null,null,null,null,null,null,null,null,null,null,null,null,null,null,null,null,137]
[null,null,null,null,null,null,null,null,null,null,null,null,null,null,null,null,null,null,null,null,null,null,null,null,null,null,null,null,138]
[null,null,null,null,null,null,null,null,null,null,null,null,null,null,null,null,null,null,null,null,null,null,null,null,null,null,null,null,139]
[null,null,null,null,null,null,null,null,null,null,null,null,null,null,null,null,null,null,null,null,null,null,null,null,null,null,null,null,140]
[null,null,null,null,null,null,null,null,null,null,null,null,null,null,null,null,null,null,null,null,null,null,null,null,null,null,null,null,141]
[null,null,null,null,null,null,null,null,null,null,null,null,null,null,null,null,null,null,null,null,null,null,null,null,null,null,null,null,142]
[null,null,null,null,null,null,null,null,null,null,null,null,null,null,null,null,null,null,null,null,null,null,null,null,null,null,null,null,143]
[null,null,null,null,null,null,null,null,null,null,null,null,null,null,null,null,null,null,null,null,null,null,null,null,null,null,null,null,144]
[null,null,null,null,null,null,null,null,null,null,null,null,null,null,null,null,null,null,null,null,null,null,null,null,null,null,null,null,145]
[null,null,null,null,null,null,null,null,null,null,null,null,null,null,null,null,null,null,null,null,null,null,null,null,null,null,null,null,146]
[null,null,null,null,null,null,null,null,null,null,null,null,null,null,null,null,null,null,null,null,null,null,null,null,null,null,null,null,147]
[null,null,null,null,null,null,null,null,null,null,null,null,null,null,null,null,null,null,null,null,null,null,null,null,null,null,null,null,148]
[null,null,null,null,null,null,null,null,null,null,null,null,null,null,null,null,null,null,null,null,null,null,null,null,null,null,null,null,149]
[null,null,null,null,null,null,null,null,null,null,null,null,null,null,null,null,null,null,null,null,null,null,null,null,null,null,null,null,150]
[null,null,null,null,null,null,null,null,null,null,null,null,null,null,null,null,null,null,null,null,null,null,null,null,null,null,null,null,151]
[null,null,null,null,null,null,null,null,null,null,null,null,null,null,null,null,null,null,null,null,null,null,null,null,null,null,null,null,152]
[null,null,null,null,null,null,null,null,null,null,null,null,null,null,null,null,null,null,null,null,null,null,null,null,null,null,null,null,153]
[null,null,null,null,null,null,null,null,null,null,null,null,null,null,null,null,null,null,null,null,null,null,null,null,null,null,null,null,154]
[null,null,null,null,null,null,null,null,null,null,null,null,null,null,null,null,null,null,null,null,null,null,null,null,null,null,null,null,155]
[null,null,null,null,null,null,null,null,null,null,null,null,null,null,null,null,null,null,null,null,null,null,null,null,null,null,null,null,156]
[null,null,null,null,null,null,null,null,null,null,null,null,null,null,null,null,null,null,null,null,null,null,null,null,null,null,null,null,157]
[null,null,null,null,null,null,null,null,null,null,null,null,null,null,null,null,null,null,null,null,null,null,null,null,null,null,null,null,158]
[null,null,null,null,null,null,null,null,null,null,null,null,null,null,null,null,null,null,null,null,null,null,null,null,null,null,null,null,159]
[null,null,null,null,null,null,null,null,null,null,null,null,null,null,null,null,null,null,null,null,null,null,null,null,null,null,null,null,160]
[null,null,null,null,null,null,null,null,null,null,null,null,null,null,null,null,null,null,null,null,null,null,null,null,null,null,null,null,161]
[null,null,null,null,null,null,null,null,null,null,null,null,null,null,null,null,null,null,null,null,null,null,null,null,null,null,null,null,162]
[null,null,null,null,null,null,null,null,null,null,null,null,null,null,null,null,null,null,null,null,null,null,null,null,null,null,null,null,163]
[null,null,null,null,null,null,null,null,null,null,null,null,null,null,null,null,null,null,null,null,null,null,null,null,null,null,null,null,164]
[null,null,null,null,null,null,null,null,null,null,null,null,null,null,null,null,null,null,null,null,null,null,null,null,null,null,null,null,165]
[null,null,null,null,null,null,null,null,null,null,null,null,null,null,null,null,null,null,null,null,null,null,null,null,null,null,null,null,166]
[null,null,null,null,null,null,null,null,null,null,null,null,null,null,null,null,null,null,null,null,null,null,null,null,null,null,null,null,167]
[null,null,null,null,null,null,null,null,null,null,null,null,null,null,null,null,null,null,null,null,null,null,null,null,null,null,null,null,168]
[null,null,null,null,null,null,null,null,null,null,null,null,null,null,null,null,null,null,null,null,null,null,null,null,null,null,null,null,169]
[null,null,null,null,null,null,null,null,null,null,null,null,null,null,null,null,null,null,null,null,null,null,null,null,null,null,null,null,170]
[null,null,null,null,null,null,null,null,null,null,null,null,null,null,null,null,null,null,null,null,null,null,null,null,null,null,null,null,171]
[null,null,null,null,null,null,null,null,null,null,null,null,null,null,null,null,null,null,null,null,null,null,null,null,null,null,null,null,172]
[null,null,null,null,null,null,null,null,null,null,null,null,null,null,null,null,null,null,null,null,null,null,null,null,null,null,null,null,173]
[null,null,null,null,null,null,null,null,null,null,null,null,null,null,null,null,null,null,null,null,null,null,null,null,null,null,null,null,174]
[null,null,null,null,null,null,null,null,null,null,null,null,null,null,null,null,null,null,null,null,null,null,null,null,null,null,null,null,175]
[null,null,null,null,null,null,null,null,null,null,null,null,null,null,null,null,null,null,null,null,null,null,null,null,null,null,null,null,176]
{"$rows_left_out":424}